{"text_format":"1","workbook":"xlsx","n_sheets":13,"sheets":["Configuration","Modèle liste élèves","Configuration Liste élèves","Modèle","Liste CE1","Lundi","Mardi","Mercredi","Jeudi","Vendredi","Semainier","Planning annuel","Programmation annuelle"],"not_rendered":{"charts":1,"images":0,"macros":1,"external_links":0,"defined_names":18,"comments":6,"pivot_tables":0},"unopened":[],"bounds":{"document_bytes":16777216,"sheet_cells":100000,"rows_first":2000,"rows_last":500,"rows_between":2000,"halvings":0,"cell_chars":16384,"cell_head_chars":4096},"cells_cut":0,"cells_raw":0,"read":"whole","date_system":"1900"}

{"sheet":"Configuration","index":0,"n_rows":37,"n_cols":13,"rows_kept":37,"cut":false,"hidden":false,"merged":[[13,3,14,3],[15,3,16,3],[17,3,18,3],[19,3,20,3],[3,0,5,3],[6,2,6,3],[7,3,8,5],[9,3,10,3],[11,3,12,3]]}
[]
[]
[]
["Cahier journal V3"]
[]
[]
[2017,"-",2018,null,null,null,null,null,null,null,null,1,"Janvier"]
[null,null,null,"Vacances scolaires",null,null,null,null,null,null,null,2,"février"]
[null,null,null,null,null,null,null,null,null,null,null,3,"mars"]
["Année scolaire :","2017-2018",null,"Vacances d’été (année précédente)","début","2016-07-05",{"$f":"F10+1","v":"2016-07-06"},null,null,null,null,4,"avril"]
["Circonscription :","votre circconscription",null,null,"fin","2016-09-01","2016-09-02",null,null,null,null,5,"mai"]
["École :","votre école",null,"Vacances de la Toussaint","début","2016-10-19","2016-10-20",null,null,null,null,6,"juin"]
["Classe :","niveau",null,null,"fin","2016-11-03","2016-11-04",null,null,null,null,7,"juillet"]
["Nom de l’enseignant de la classe :","Mr DUPONT",null,"vacances de Noël","début","2016-12-17","2016-12-18",null,null,null,null,8,"août"]
[null,null,null,null,"fin","2017-01-03","2017-01-04",null,null,null,null,9,"septembre"]
[null,null,null,"Vacances d’hiver","début","2017-02-04","2017-02-05",null,null,null,null,10,"octobre"]
["Début date des programmations :","2017-09-04",null,null,"fin","2017-02-20","2017-02-21",null,null,null,null,11,"novembre"]
[null,null,null,"Vacances de printemps","début","2017-04-01","2017-04-02",null,null,null,null,12,"décembre"]
[null,null,null,null,"fin","2017-04-18","2017-04-19"]
[null,null,null,"Vacances d’été","début","2017-07-08","2017-07-09"]
[null,null,null,null,"fin","2017-09-01","2017-09-02"]
[]
[]
[]
[null,null,null,"Liste des jours fériés","Date"]
[null,null,null,"Jour de l’an",{"$f":"DATE(C7,1,1)","v":"2018-01-01"}]
[null,null,null,"Lundi de Pâques",{"$f":"ROUND(DATE($C$7,4,MOD(234-11*MOD($C$7,19),30))/7,0)*7-6","v":"2018-04-01"}]
[null,null,null,"Fête du travail",{"$f":"DATE(C7,5,1)","v":"2018-05-01"}]
[null,null,null,"8 mai 1945",{"$f":"DATE(C7,5,8)","v":"2018-05-08"}]
[null,null,null,"Jeudi de l’Ascension",{"$f":"$E$27+39","v":"2018-05-10"}]
[null,null,null,"Lundi de Pentecôte",{"$f":"E27+50","v":"2018-05-21"}]
[null,null,null,"Fête Nationale",{"$f":"DATE(C7,7,14)","v":"2018-07-14"}]
[null,null,null,"Assomption",{"$f":"DATE(A7,8,15)","v":"2017-08-15"}]
[null,null,null,"La Toussaint",{"$f":"DATE(A7,11,1)","v":"2017-11-01"}]
[null,null,null,"Armistice",{"$f":"DATE(A7,11,11)","v":"2017-11-11"}]
[null,null,null,"Noël",{"$f":"DATE(A7,12,25)","v":"2017-12-25"}]
[null,null,null,"etc.."]

{"sheet":"Modèle liste élèves","index":1,"n_rows":7,"n_cols":18,"rows_kept":7,"cut":false,"hidden":true,"merged":[[0,1,0,13]]}
[null,"Liste élèves"]
["École:",null,{"$f":"Configuration!B12","v":"votre école"}]
["Enseignant:",null,{"$f":"Configuration!B14","v":"Mr DUPONT"}]
["Année scolaire:",null,{"$f":"Configuration!B10","v":"2017-2018"}]
["Classe de:",null,{"$f":"Configuration!B13","v":"niveau"}]
[null,null,null," "," "," "," "," "," "," ",null," "," "," "," "," "," "," "]
["N°","Nom","Prénom","Niv"]

{"sheet":"Configuration Liste élèves","index":2,"n_rows":224,"n_cols":17,"rows_kept":224,"cut":false,"hidden":false,"merged":[[6,14,6,15],[1,14,1,15],[2,14,2,15],[3,14,3,15],[4,14,4,15],[5,14,5,15],[39,9,39,10],[33,9,33,11],[34,9,34,10],[35,9,35,10],[36,9,36,10],[37,9,37,10],[38,9,38,10]]}
[]
[null,"Liste élèves",null,null,null,null,null,null,null,null,null,null,null,null,"absence matin",null,"―"]
[null,null,null,null,null,null,null,null,null,null,null,null,null,null,"Absence après-midi",null,"│"]
["Année scolaire",null,{"$f":"Configuration!B10","v":"2017-2018"},null,null,null,null,null,null,null,null,null,null,null,"Absenc toute la journée",null,"+"]
[null,null,null,null,null,null,null,null,null,null,null,null,null,null,"retard",null,"● r"]
["Classe",null,"CE1",null,null,null,null,null,null,null,null,null,null,null,"présent",null,"●"]
[null,null,null,null,null,null,null,null,null,null,null,null,null,null,"Absences justifiées",null,"― j"]
["Rentrez ci-dessous votre liste d'élève (dans l'ordre alphabétique ou non )",null,null,null,null,null,null,null,null,null,null,null,null,null,null,null,"│ j"]
[null,null,null,null,null,null,null,"Pour copier votre graphique, il faut juste le sélectionner et faire imprimer",null,null,null,null,null,null,null,null,"+ j"]
["Num","Nom","Prénom","Niveau","Dates de naissance","Sexe",null,"année naissance"]
[{"$f":"IF(B11=\"\",\"\",0+1)","v":1},"Jean","Mathieux","CE2","2007-05-12","Masculin",{"$f":"IF(F11=\"Masculin\",1,0)","v":1},{"$f":"YEAR(E11)","v":2007},null,null,null,null,null,null,null,null,"Masculin"]
[{"$f":"IF(B12=\"\",\"\",A11+1)","v":2},"Gabin","Yanis","CE1","2007-05-14","Masculin",{"$f":"IF(F12=\"Masculin\",1,0)","v":1},{"$f":"YEAR(E12)","v":2007},null,null,null,null,null,null,null,null,"Féminin"]
[{"$f":"IF(B13=\"\",\"\",A12+1)","v":3},"Ruth","Solène","CE1","2007-06-17","Féminin",0,2007]
[{"$f":"IF(B14=\"\",\"\",A13+1)","v":4},"Boby","Fares","CE2","2007-03-25","Masculin",1,2007]
[{"$f":"IF(B15=\"\",\"\",A14+1)","v":5},"Joyan","Sam","CE1","2007-12-12","Masculin",1,2007]
[{"$f":"IF(B16=\"\",\"\",A15+1)","v":6},"Soyan","Sophie","CE2","2007-01-14","Féminin",0,2007]
[{"$f":"IF(B17=\"\",\"\",A16+1)","v":7},"marin","Yanis","CE1",null,"Féminin",0,1900]
[{"$f":"IF(B18=\"\",\"\",A17+1)","v":8},"sophie","farid","CE2",null,"Masculin",1,1900]
[{"$f":"IF(B19=\"\",\"\",A18+1)","v":9},"fras","jjkyf","CE2",null,"Masculin",1,1900]
[{"$f":"IF(B20=\"\",\"\",A19+1)","v":10},"fzef","dgfhjf","CE1",null,"Masculin",1,1900]
[{"$f":"IF(B21=\"\",\"\",A20+1)","v":11},"gstdeh","dfr","CE1",null,"Masculin",1,1900]
[{"$f":"IF(B22=\"\",\"\",A21+1)","v":12},"str","rfgh","CE1",null,"Féminin",0,1900]
[{"$f":"IF(B23=\"\",\"\",A22+1)","v":13},"dgfhf","gdfee","CE1",null,"Masculin",1,1900]
[{"$f":"IF(B24=\"\",\"\",A23+1)","v":14},"eyrehj","dfguy","CE1",null,"Masculin",1,1900]
[{"$f":"IF(B25=\"\",\"\",A24+1)","v":15},"dfhhs","yriutèi","CE1",null,"Masculin",1,1900]
[{"$f":"IF(B26=\"\",\"\",A25+1)","v":16},"qzqg","yuihgf","CE2",null,"Masculin",1,1900]
[{"$f":"IF(B27=\"\",\"\",A26+1)","v":17},"qgeh","rthhd","CE1",null,"Masculin",1,1900]
[{"$f":"IF(B28=\"\",\"\",A27+1)","v":18},"qerhe","ghreyuj","CE1",null,"Masculin",1,1900]
[{"$f":"IF(B29=\"\",\"\",A28+1)","v":19},"ehterhu","ghrt","CE2",null,"Féminin",0,1900]
[{"$f":"IF(B30=\"\",\"\",A29+1)","v":20},"rtjsrtj","trhbnd","CE1",null,"Féminin",0,1900]
[{"$f":"IF(B31=\"\",\"\",A30+1)","v":21},"rjytk","eryu","CE2",null,"Féminin",0,1900]
[{"$f":"IF(B32=\"\",\"\",A31+1)","v":22},"tdyk","hge","CE1",null,"Féminin",0,1900]
[{"$f":"IF(B33=\"\",\"\",A32+1)","v":23},"djtdyjt","efg","CE2",null,"Féminin",0,1900]
[{"$f":"IF(B34=\"\",\"\",A33+1)","v":24},"ydjdkt","jjtyer","CE2",null,"Féminin",0,1900,null,"code absences/présences"]
[{"$f":"IF(B35=\"\",\"\",A34+1)","v":25},"djky","gfre","CE1",null,"Féminin",0,null,null,"Absence matin",null,"―"]
[{"$f":"IF(B36=\"\",\"\",A35+1)","v":26},"ydikyl;","gfhjkty","CE1",null,"Féminin",0,1900,null,"Absence après-midi",null,"│"]
[{"$f":"IF(B37=\"\",\"\",A36+1)","v":27},"tkyiutlk","tjtrr","CE1",null,"Féminin",0,1900,null,"Absence toute la journée",null,"+"]
[{"$f":"IF(B38=\"\",\"\",A37+1)","v":28},"tylkdtt","hfv","CE1",null,"féminin",0,1900,null,"retard",null,"● r"]
[{"$f":"IF(B39=\"\",\"\",A38+1)","v":29},"dykitlu","drty","CE1",null,"Masculin",1,1900,null,"présent",null,"●"]
[{"$f":"IF(B40=\"\",\"\",A39+1)","v":30},"tkuyttd","tkkyt","CE1",null,"Masculin",1,1900,null,"Absences justifiées",null,"― j"]
[{"$f":"IF(B41=\"\",\"\",A40+1)","v":31},"tukyly","rtrtgg","CE2",null,"Masculin",1,1900,null,null,null,"│ j"]
[{"$f":"IF(B42=\"\",\"\",A41+1)","v":32},"dttjlyyl","fgjkyt","CE1",null,"Féminin",0,1900,null,null,null,"+ j"]
[{"$f":"IF(B43=\"\",\"\",A42+1)","v":33},"ddjytku","tykutyi","CE1",null,"Féminin",0,1900]
[{"$f":"IF(B44=\"\",\"\",A43+1)","v":34},"tykumi","tyulyu","CE2",null,"Féminin",0,1900]
[{"$f":"IF(B45=\"\",\"\",A44+1)","v":35},"ytjuykilm;","yuyly","CE1",null,"Féminin",0,1900]
[{"$f":"IF(B46=\"\",\"\",A45+1)","v":36},"ytjktrh","ytlylu","CE2",null,"Masculin",1,1900]
[{"$f":"IF(B47=\"\",\"\",A46+1)","v":37},"tkippm","ylyyrft","CE1",null,"Masculin",1,1900]
[{"$f":"IF(B48=\"\",\"\",A47+1)","v":38},"tjhg","tyjngh","CE2",null,"Masculin",1,1900]
[{"$f":"IF(B49=\"\",\"\",A48+1)","v":39},"ttty","rtuh","CE2",null,"Féminin",0,1900]
[{"$f":"IF(B50=\"\",\"\",A49+1)","v":40},"jjiiik","ghjgkg","CE1",null,"Féminin",0,1900]
[{"$f":"IF(B51=\"\",\"\",A50+1)","v":41},"jgjrt","tuyyul","CE1",null,"Féminin",0,1900]
[{"$f":"IF(B52=\"\",\"\",#REF!+1)","v":""},null,null,null,null,null,{"$f":"SUM(G11:G51)","v":20},"garçons"]
[{"$f":"IF(B53=\"\",\"\",A52+1)","v":""},null,null,null,null,null,{"$f":"COUNTA(G11:G51)-G52","v":21},"filles"]
[{"$f":"IF(B54=\"\",\"\",A53+1)","v":""}]
[{"$f":"IF(B55=\"\",\"\",A54+1)","v":""}]
[{"$f":"IF(B56=\"\",\"\",A55+1)","v":""}]
[{"$f":"IF(B57=\"\",\"\",A56+1)","v":""}]
[{"$f":"IF(B58=\"\",\"\",A57+1)","v":""}]
[{"$f":"IF(B59=\"\",\"\",A58+1)","v":""}]
[{"$f":"IF(B60=\"\",\"\",A59+1)","v":""}]
[{"$f":"IF(B61=\"\",\"\",A60+1)","v":""}]
[{"$f":"IF(B62=\"\",\"\",A61+1)","v":""}]
[{"$f":"IF(B63=\"\",\"\",A62+1)","v":""}]
[{"$f":"IF(B64=\"\",\"\",A63+1)","v":""}]
[{"$f":"IF(B65=\"\",\"\",A64+1)","v":""}]
[{"$f":"IF(B66=\"\",\"\",A65+1)","v":""}]
[{"$f":"IF(B67=\"\",\"\",A66+1)","v":""}]
[{"$f":"IF(B68=\"\",\"\",A67+1)","v":""}]
[{"$f":"IF(B69=\"\",\"\",A68+1)","v":""}]
[{"$f":"IF(B70=\"\",\"\",A69+1)","v":""}]
[{"$f":"IF(B71=\"\",\"\",A70+1)","v":""}]
[{"$f":"IF(B72=\"\",\"\",A71+1)","v":""}]
[{"$f":"IF(B73=\"\",\"\",A72+1)","v":""}]
[{"$f":"IF(B74=\"\",\"\",A73+1)","v":""}]
[{"$f":"IF(B75=\"\",\"\",A74+1)","v":""}]
[{"$f":"IF(B76=\"\",\"\",A75+1)","v":""}]
[{"$f":"IF(B77=\"\",\"\",A76+1)","v":""}]
[{"$f":"IF(B78=\"\",\"\",A77+1)","v":""}]
[{"$f":"IF(B79=\"\",\"\",A78+1)","v":""}]
[{"$f":"IF(B80=\"\",\"\",A79+1)","v":""}]
[{"$f":"IF(B81=\"\",\"\",A80+1)","v":""}]
[{"$f":"IF(B82=\"\",\"\",A81+1)","v":""}]
[{"$f":"IF(B83=\"\",\"\",A82+1)","v":""}]
[{"$f":"IF(B84=\"\",\"\",A83+1)","v":""}]
[{"$f":"IF(B85=\"\",\"\",A84+1)","v":""}]
[{"$f":"IF(B86=\"\",\"\",A85+1)","v":""}]
[{"$f":"IF(B87=\"\",\"\",A86+1)","v":""}]
[{"$f":"IF(B88=\"\",\"\",A87+1)","v":""}]
[{"$f":"IF(B89=\"\",\"\",A88+1)","v":""}]
[{"$f":"IF(B90=\"\",\"\",A89+1)","v":""}]
[{"$f":"IF(B91=\"\",\"\",A90+1)","v":""}]
[{"$f":"IF(B92=\"\",\"\",A91+1)","v":""}]
[{"$f":"IF(B93=\"\",\"\",A92+1)","v":""}]
[{"$f":"IF(B94=\"\",\"\",A93+1)","v":""}]
[{"$f":"IF(B95=\"\",\"\",A94+1)","v":""}]
[{"$f":"IF(B96=\"\",\"\",A95+1)","v":""}]
[{"$f":"IF(B97=\"\",\"\",A96+1)","v":""}]
[{"$f":"IF(B98=\"\",\"\",A97+1)","v":""}]
[{"$f":"IF(B99=\"\",\"\",A98+1)","v":""}]
[{"$f":"IF(B100=\"\",\"\",A99+1)","v":""}]
[{"$f":"IF(B101=\"\",\"\",A100+1)","v":""}]
[{"$f":"IF(B102=\"\",\"\",A101+1)","v":""}]
[{"$f":"IF(B103=\"\",\"\",A102+1)","v":""}]
[{"$f":"IF(B104=\"\",\"\",A103+1)","v":""}]
[{"$f":"IF(B105=\"\",\"\",A104+1)","v":""}]
[{"$f":"IF(B106=\"\",\"\",A105+1)","v":""}]
[{"$f":"IF(B107=\"\",\"\",A106+1)","v":""}]
[{"$f":"IF(B108=\"\",\"\",A107+1)","v":""}]
[{"$f":"IF(B109=\"\",\"\",A108+1)","v":""}]
[{"$f":"IF(B110=\"\",\"\",A109+1)","v":""}]
[{"$f":"IF(B111=\"\",\"\",A110+1)","v":""}]
[{"$f":"IF(B112=\"\",\"\",A111+1)","v":""}]
[{"$f":"IF(B113=\"\",\"\",A112+1)","v":""}]
[{"$f":"IF(B114=\"\",\"\",A113+1)","v":""}]
[{"$f":"IF(B115=\"\",\"\",A114+1)","v":""}]
["Num","Nom","Prénom"]
["Veuillez écrire votre liste d'élèves ci-dessous puis la trier par ordre alphabétique (si c'est pas déjà fait !)"]
[]
[]
[]
[]
[]
[]
[]
[]
[]
[]
[]
[{"$f":"IF(B129=\"\",\"\",A128+1)","v":""}]
[""]
[{"$f":"IF(B131=\"\",\"\",A130+1)","v":""}]
[""]
[""]
[""]
[""]
[""]
[""]
[""]
[""]
[""]
[""]
[""]
[""]
[""]
[""]
[""]
[""]
[""]
[""]
[""]
[""]
[""]
[""]
[""]
[""]
[""]
[""]
[""]
[""]
[""]
[""]
[""]
[""]
[""]
[""]
[""]
[""]
[""]
[""]
[""]
[""]
[""]
[""]
[""]
[""]
[""]
[""]
[""]
[""]
[""]
[""]
[""]
[""]
[""]
[""]
[""]
[""]
[""]
[""]
[""]
[""]
[""]
[""]
[""]
[{"$f":"IF(B195=\"\",\"\",A194+1)","v":""}]
[""]
[""]
[""]
[""]
[""]
[""]
[""]
[""]
[""]
[""]
[""]
[""]
[""]
[""]
[""]
[""]
[""]
[""]
[""]
[""]
[""]
[""]
[""]
[""]
[""]
[""]
[""]
[""]
[""]

{"sheet":"Modèle","index":3,"n_rows":226,"n_cols":7,"rows_kept":226,"cut":false,"hidden":true,"merged":[[130,2,130,5],[132,2,132,5],[133,2,133,5],[134,2,134,5],[135,2,135,5],[0,1,0,2],[129,2,129,5]]}
[null,"Liste d'appel",null,null,{"$f":"'Configuration Liste élèves'!C6","v":"CE1"}]
["le",{"$f":"TODAY()","v":"2017-08-17"},"Présences matin",null,{"$f":"IF(INDIRECT(\"G6\")=TODAY(),INDIRECT(\"G130\"),\"\")","v":""}]
[null,null,"Présences après-midi",null,{"$f":"IF(INDIRECT(\"G6\")=TODAY(),INDIRECT(\"G131\"),\"\")","v":""}]
[null,null,"Absences",null,{"$f":"IF(INDIRECT(\"G6\")=TODAY(),INDIRECT(\"G136\"),\"\")","v":""}]
[]
["Num","Noms","Prénoms","Dates en cours","Ret","Abs"]
[null,{"$f":"IF(A7=\"\",\"\",'Configuration Liste élèves'!B52)","v":""},{"$f":"IF(B7=\"\",\"\",'Configuration Liste élèves'!C52)","v":""},null,{"$f":"IF(B7=\"\",\"\",COUNTIF(INDIRECT(\"G\"&ROW()):INDIRECT(\"WH\"&ROW()),'Configuration Liste élèves'!$Q$5))","v":""},{"$f":"IF(B7=\"\",\"\",COUNTIF(INDIRECT(\"G\"&ROW()):INDIRECT(\"WH\"&ROW()),'Configuration Liste élèves'!$Q$2)+COUNTIF(INDIRECT(\"G\"&ROW()):INDIRECT(\"WH\"&ROW()),'Configuration Liste élèves'!$Q$3)+2*(COUNTIF(INDIRECT(\"G\"&ROW()):INDIRECT(\"WH\"&ROW()),'Configuration Liste élèves'!$Q$4+COUNTIF(INDIRECT(\"G\"&ROW()):INDIRECT(\"WH\"&ROW()),'Configuration Liste élèves'!$Q$7)+COUNTIF(INDIRECT(\"G\"&ROW()):INDIRECT(\"WH\"&ROW()),'Configuration Liste élèves'!$Q$8)+2*(COUNTIF(INDIRECT(\"G\"&ROW()):INDIRECT(\"WH\"&ROW()),'Configuration Liste élèves'!$Q$9)))))","v":""}]
[null,{"$f":"IF(A8=\"\",\"\",'Configuration Liste élèves'!B53)","v":""},{"$f":"IF(B8=\"\",\"\",'Configuration Liste élèves'!C53)","v":""},null,{"$f":"IF(B8=\"\",\"\",COUNTIF(INDIRECT(\"G\"&ROW()):INDIRECT(\"WH\"&ROW()),'Configuration Liste élèves'!$Q$5))","v":""},{"$f":"IF(B8=\"\",\"\",COUNTIF(INDIRECT(\"G\"&ROW()):INDIRECT(\"WH\"&ROW()),'Configuration Liste élèves'!$Q$2)+COUNTIF(INDIRECT(\"G\"&ROW()):INDIRECT(\"WH\"&ROW()),'Configuration Liste élèves'!$Q$3)+2*(COUNTIF(INDIRECT(\"G\"&ROW()):INDIRECT(\"WH\"&ROW()),'Configuration Liste élèves'!$Q$4+COUNTIF(INDIRECT(\"G\"&ROW()):INDIRECT(\"WH\"&ROW()),'Configuration Liste élèves'!$Q$7)+COUNTIF(INDIRECT(\"G\"&ROW()):INDIRECT(\"WH\"&ROW()),'Configuration Liste élèves'!$Q$8)+2*(COUNTIF(INDIRECT(\"G\"&ROW()):INDIRECT(\"WH\"&ROW()),'Configuration Liste élèves'!$Q$9)))))","v":""}]
[null,{"$f":"IF(A9=\"\",\"\",'Configuration Liste élèves'!B54)","v":""},{"$f":"IF(B9=\"\",\"\",'Configuration Liste élèves'!C54)","v":""},null,{"$f":"IF(B9=\"\",\"\",COUNTIF(INDIRECT(\"G\"&ROW()):INDIRECT(\"WH\"&ROW()),'Configuration Liste élèves'!$Q$5))","v":""},{"$f":"IF(B9=\"\",\"\",COUNTIF(INDIRECT(\"G\"&ROW()):INDIRECT(\"WH\"&ROW()),'Configuration Liste élèves'!$Q$2)+COUNTIF(INDIRECT(\"G\"&ROW()):INDIRECT(\"WH\"&ROW()),'Configuration Liste élèves'!$Q$3)+2*(COUNTIF(INDIRECT(\"G\"&ROW()):INDIRECT(\"WH\"&ROW()),'Configuration Liste élèves'!$Q$4+COUNTIF(INDIRECT(\"G\"&ROW()):INDIRECT(\"WH\"&ROW()),'Configuration Liste élèves'!$Q$7)+COUNTIF(INDIRECT(\"G\"&ROW()):INDIRECT(\"WH\"&ROW()),'Configuration Liste élèves'!$Q$8)+2*(COUNTIF(INDIRECT(\"G\"&ROW()):INDIRECT(\"WH\"&ROW()),'Configuration Liste élèves'!$Q$9)))))","v":""}]
[null,{"$f":"IF(A10=\"\",\"\",'Configuration Liste élèves'!B55)","v":""},{"$f":"IF(B10=\"\",\"\",'Configuration Liste élèves'!C55)","v":""},null,{"$f":"IF(B10=\"\",\"\",COUNTIF(INDIRECT(\"G\"&ROW()):INDIRECT(\"WH\"&ROW()),'Configuration Liste élèves'!$Q$5))","v":""},{"$f":"IF(B10=\"\",\"\",COUNTIF(INDIRECT(\"G\"&ROW()):INDIRECT(\"WH\"&ROW()),'Configuration Liste élèves'!$Q$2)+COUNTIF(INDIRECT(\"G\"&ROW()):INDIRECT(\"WH\"&ROW()),'Configuration Liste élèves'!$Q$3)+2*(COUNTIF(INDIRECT(\"G\"&ROW()):INDIRECT(\"WH\"&ROW()),'Configuration Liste élèves'!$Q$4+COUNTIF(INDIRECT(\"G\"&ROW()):INDIRECT(\"WH\"&ROW()),'Configuration Liste élèves'!$Q$7)+COUNTIF(INDIRECT(\"G\"&ROW()):INDIRECT(\"WH\"&ROW()),'Configuration Liste élèves'!$Q$8)+2*(COUNTIF(INDIRECT(\"G\"&ROW()):INDIRECT(\"WH\"&ROW()),'Configuration Liste élèves'!$Q$9)))))","v":""}]
[null,{"$f":"IF(A11=\"\",\"\",'Configuration Liste élèves'!B56)","v":""},{"$f":"IF(B11=\"\",\"\",'Configuration Liste élèves'!C56)","v":""},null,{"$f":"IF(B11=\"\",\"\",COUNTIF(INDIRECT(\"G\"&ROW()):INDIRECT(\"WH\"&ROW()),'Configuration Liste élèves'!$Q$5))","v":""},{"$f":"IF(B11=\"\",\"\",COUNTIF(INDIRECT(\"G\"&ROW()):INDIRECT(\"WH\"&ROW()),'Configuration Liste élèves'!$Q$2)+COUNTIF(INDIRECT(\"G\"&ROW()):INDIRECT(\"WH\"&ROW()),'Configuration Liste élèves'!$Q$3)+2*(COUNTIF(INDIRECT(\"G\"&ROW()):INDIRECT(\"WH\"&ROW()),'Configuration Liste élèves'!$Q$4+COUNTIF(INDIRECT(\"G\"&ROW()):INDIRECT(\"WH\"&ROW()),'Configuration Liste élèves'!$Q$7)+COUNTIF(INDIRECT(\"G\"&ROW()):INDIRECT(\"WH\"&ROW()),'Configuration Liste élèves'!$Q$8)+2*(COUNTIF(INDIRECT(\"G\"&ROW()):INDIRECT(\"WH\"&ROW()),'Configuration Liste élèves'!$Q$9)))))","v":""}]
[null,{"$f":"IF(A12=\"\",\"\",'Configuration Liste élèves'!B57)","v":""},{"$f":"IF(B12=\"\",\"\",'Configuration Liste élèves'!C57)","v":""},null,{"$f":"IF(B12=\"\",\"\",COUNTIF(INDIRECT(\"G\"&ROW()):INDIRECT(\"WH\"&ROW()),'Configuration Liste élèves'!$Q$5))","v":""},{"$f":"IF(B12=\"\",\"\",COUNTIF(INDIRECT(\"G\"&ROW()):INDIRECT(\"WH\"&ROW()),'Configuration Liste élèves'!$Q$2)+COUNTIF(INDIRECT(\"G\"&ROW()):INDIRECT(\"WH\"&ROW()),'Configuration Liste élèves'!$Q$3)+2*(COUNTIF(INDIRECT(\"G\"&ROW()):INDIRECT(\"WH\"&ROW()),'Configuration Liste élèves'!$Q$4+COUNTIF(INDIRECT(\"G\"&ROW()):INDIRECT(\"WH\"&ROW()),'Configuration Liste élèves'!$Q$7)+COUNTIF(INDIRECT(\"G\"&ROW()):INDIRECT(\"WH\"&ROW()),'Configuration Liste élèves'!$Q$8)+2*(COUNTIF(INDIRECT(\"G\"&ROW()):INDIRECT(\"WH\"&ROW()),'Configuration Liste élèves'!$Q$9)))))","v":""}]
[null,{"$f":"IF(A13=\"\",\"\",'Configuration Liste élèves'!B58)","v":""},{"$f":"IF(B13=\"\",\"\",'Configuration Liste élèves'!C58)","v":""},null,{"$f":"IF(B13=\"\",\"\",COUNTIF(INDIRECT(\"G\"&ROW()):INDIRECT(\"WH\"&ROW()),'Configuration Liste élèves'!$Q$5))","v":""},{"$f":"IF(B13=\"\",\"\",COUNTIF(INDIRECT(\"G\"&ROW()):INDIRECT(\"WH\"&ROW()),'Configuration Liste élèves'!$Q$2)+COUNTIF(INDIRECT(\"G\"&ROW()):INDIRECT(\"WH\"&ROW()),'Configuration Liste élèves'!$Q$3)+2*(COUNTIF(INDIRECT(\"G\"&ROW()):INDIRECT(\"WH\"&ROW()),'Configuration Liste élèves'!$Q$4+COUNTIF(INDIRECT(\"G\"&ROW()):INDIRECT(\"WH\"&ROW()),'Configuration Liste élèves'!$Q$7)+COUNTIF(INDIRECT(\"G\"&ROW()):INDIRECT(\"WH\"&ROW()),'Configuration Liste élèves'!$Q$8)+2*(COUNTIF(INDIRECT(\"G\"&ROW()):INDIRECT(\"WH\"&ROW()),'Configuration Liste élèves'!$Q$9)))))","v":""}]
[null,{"$f":"IF(A14=\"\",\"\",'Configuration Liste élèves'!B59)","v":""},{"$f":"IF(B14=\"\",\"\",'Configuration Liste élèves'!C59)","v":""},null,{"$f":"IF(B14=\"\",\"\",COUNTIF(INDIRECT(\"G\"&ROW()):INDIRECT(\"WH\"&ROW()),'Configuration Liste élèves'!$Q$5))","v":""},{"$f":"IF(B14=\"\",\"\",COUNTIF(INDIRECT(\"G\"&ROW()):INDIRECT(\"WH\"&ROW()),'Configuration Liste élèves'!$Q$2)+COUNTIF(INDIRECT(\"G\"&ROW()):INDIRECT(\"WH\"&ROW()),'Configuration Liste élèves'!$Q$3)+2*(COUNTIF(INDIRECT(\"G\"&ROW()):INDIRECT(\"WH\"&ROW()),'Configuration Liste élèves'!$Q$4+COUNTIF(INDIRECT(\"G\"&ROW()):INDIRECT(\"WH\"&ROW()),'Configuration Liste élèves'!$Q$7)+COUNTIF(INDIRECT(\"G\"&ROW()):INDIRECT(\"WH\"&ROW()),'Configuration Liste élèves'!$Q$8)+2*(COUNTIF(INDIRECT(\"G\"&ROW()):INDIRECT(\"WH\"&ROW()),'Configuration Liste élèves'!$Q$9)))))","v":""}]
[null,{"$f":"IF(A15=\"\",\"\",'Configuration Liste élèves'!B60)","v":""},{"$f":"IF(B15=\"\",\"\",'Configuration Liste élèves'!C60)","v":""},null,{"$f":"IF(B15=\"\",\"\",COUNTIF(INDIRECT(\"G\"&ROW()):INDIRECT(\"WH\"&ROW()),'Configuration Liste élèves'!$Q$5))","v":""},{"$f":"IF(B15=\"\",\"\",COUNTIF(INDIRECT(\"G\"&ROW()):INDIRECT(\"WH\"&ROW()),'Configuration Liste élèves'!$Q$2)+COUNTIF(INDIRECT(\"G\"&ROW()):INDIRECT(\"WH\"&ROW()),'Configuration Liste élèves'!$Q$3)+2*(COUNTIF(INDIRECT(\"G\"&ROW()):INDIRECT(\"WH\"&ROW()),'Configuration Liste élèves'!$Q$4+COUNTIF(INDIRECT(\"G\"&ROW()):INDIRECT(\"WH\"&ROW()),'Configuration Liste élèves'!$Q$7)+COUNTIF(INDIRECT(\"G\"&ROW()):INDIRECT(\"WH\"&ROW()),'Configuration Liste élèves'!$Q$8)+2*(COUNTIF(INDIRECT(\"G\"&ROW()):INDIRECT(\"WH\"&ROW()),'Configuration Liste élèves'!$Q$9)))))","v":""}]
[null,{"$f":"IF(A16=\"\",\"\",'Configuration Liste élèves'!B61)","v":""},{"$f":"IF(B16=\"\",\"\",'Configuration Liste élèves'!C61)","v":""},null,{"$f":"IF(B16=\"\",\"\",COUNTIF(INDIRECT(\"G\"&ROW()):INDIRECT(\"WH\"&ROW()),'Configuration Liste élèves'!$Q$5))","v":""},{"$f":"IF(B16=\"\",\"\",COUNTIF(INDIRECT(\"G\"&ROW()):INDIRECT(\"WH\"&ROW()),'Configuration Liste élèves'!$Q$2)+COUNTIF(INDIRECT(\"G\"&ROW()):INDIRECT(\"WH\"&ROW()),'Configuration Liste élèves'!$Q$3)+2*(COUNTIF(INDIRECT(\"G\"&ROW()):INDIRECT(\"WH\"&ROW()),'Configuration Liste élèves'!$Q$4+COUNTIF(INDIRECT(\"G\"&ROW()):INDIRECT(\"WH\"&ROW()),'Configuration Liste élèves'!$Q$7)+COUNTIF(INDIRECT(\"G\"&ROW()):INDIRECT(\"WH\"&ROW()),'Configuration Liste élèves'!$Q$8)+2*(COUNTIF(INDIRECT(\"G\"&ROW()):INDIRECT(\"WH\"&ROW()),'Configuration Liste élèves'!$Q$9)))))","v":""}]
[null,{"$f":"IF(A17=\"\",\"\",'Configuration Liste élèves'!B62)","v":""},{"$f":"IF(B17=\"\",\"\",'Configuration Liste élèves'!C62)","v":""},null,{"$f":"IF(B17=\"\",\"\",COUNTIF(INDIRECT(\"G\"&ROW()):INDIRECT(\"WH\"&ROW()),'Configuration Liste élèves'!$Q$5))","v":""},{"$f":"IF(B17=\"\",\"\",COUNTIF(INDIRECT(\"G\"&ROW()):INDIRECT(\"WH\"&ROW()),'Configuration Liste élèves'!$Q$2)+COUNTIF(INDIRECT(\"G\"&ROW()):INDIRECT(\"WH\"&ROW()),'Configuration Liste élèves'!$Q$3)+2*(COUNTIF(INDIRECT(\"G\"&ROW()):INDIRECT(\"WH\"&ROW()),'Configuration Liste élèves'!$Q$4+COUNTIF(INDIRECT(\"G\"&ROW()):INDIRECT(\"WH\"&ROW()),'Configuration Liste élèves'!$Q$7)+COUNTIF(INDIRECT(\"G\"&ROW()):INDIRECT(\"WH\"&ROW()),'Configuration Liste élèves'!$Q$8)+2*(COUNTIF(INDIRECT(\"G\"&ROW()):INDIRECT(\"WH\"&ROW()),'Configuration Liste élèves'!$Q$9)))))","v":""}]
[null,{"$f":"IF(A18=\"\",\"\",'Configuration Liste élèves'!B63)","v":""},{"$f":"IF(B18=\"\",\"\",'Configuration Liste élèves'!C63)","v":""},null,{"$f":"IF(B18=\"\",\"\",COUNTIF(INDIRECT(\"G\"&ROW()):INDIRECT(\"WH\"&ROW()),'Configuration Liste élèves'!$Q$5))","v":""},{"$f":"IF(B18=\"\",\"\",COUNTIF(INDIRECT(\"G\"&ROW()):INDIRECT(\"WH\"&ROW()),'Configuration Liste élèves'!$Q$2)+COUNTIF(INDIRECT(\"G\"&ROW()):INDIRECT(\"WH\"&ROW()),'Configuration Liste élèves'!$Q$3)+2*(COUNTIF(INDIRECT(\"G\"&ROW()):INDIRECT(\"WH\"&ROW()),'Configuration Liste élèves'!$Q$4+COUNTIF(INDIRECT(\"G\"&ROW()):INDIRECT(\"WH\"&ROW()),'Configuration Liste élèves'!$Q$7)+COUNTIF(INDIRECT(\"G\"&ROW()):INDIRECT(\"WH\"&ROW()),'Configuration Liste élèves'!$Q$8)+2*(COUNTIF(INDIRECT(\"G\"&ROW()):INDIRECT(\"WH\"&ROW()),'Configuration Liste élèves'!$Q$9)))))","v":""}]
[null,{"$f":"IF(A19=\"\",\"\",'Configuration Liste élèves'!B64)","v":""},{"$f":"IF(B19=\"\",\"\",'Configuration Liste élèves'!C64)","v":""},null,{"$f":"IF(B19=\"\",\"\",COUNTIF(INDIRECT(\"G\"&ROW()):INDIRECT(\"WH\"&ROW()),'Configuration Liste élèves'!$Q$5))","v":""},{"$f":"IF(B19=\"\",\"\",COUNTIF(INDIRECT(\"G\"&ROW()):INDIRECT(\"WH\"&ROW()),'Configuration Liste élèves'!$Q$2)+COUNTIF(INDIRECT(\"G\"&ROW()):INDIRECT(\"WH\"&ROW()),'Configuration Liste élèves'!$Q$3)+2*(COUNTIF(INDIRECT(\"G\"&ROW()):INDIRECT(\"WH\"&ROW()),'Configuration Liste élèves'!$Q$4+COUNTIF(INDIRECT(\"G\"&ROW()):INDIRECT(\"WH\"&ROW()),'Configuration Liste élèves'!$Q$7)+COUNTIF(INDIRECT(\"G\"&ROW()):INDIRECT(\"WH\"&ROW()),'Configuration Liste élèves'!$Q$8)+2*(COUNTIF(INDIRECT(\"G\"&ROW()):INDIRECT(\"WH\"&ROW()),'Configuration Liste élèves'!$Q$9)))))","v":""}]
[null,{"$f":"IF(A20=\"\",\"\",'Configuration Liste élèves'!B65)","v":""},{"$f":"IF(B20=\"\",\"\",'Configuration Liste élèves'!C65)","v":""},null,{"$f":"IF(B20=\"\",\"\",COUNTIF(INDIRECT(\"G\"&ROW()):INDIRECT(\"WH\"&ROW()),'Configuration Liste élèves'!$Q$5))","v":""},{"$f":"IF(B20=\"\",\"\",COUNTIF(INDIRECT(\"G\"&ROW()):INDIRECT(\"WH\"&ROW()),'Configuration Liste élèves'!$Q$2)+COUNTIF(INDIRECT(\"G\"&ROW()):INDIRECT(\"WH\"&ROW()),'Configuration Liste élèves'!$Q$3)+2*(COUNTIF(INDIRECT(\"G\"&ROW()):INDIRECT(\"WH\"&ROW()),'Configuration Liste élèves'!$Q$4+COUNTIF(INDIRECT(\"G\"&ROW()):INDIRECT(\"WH\"&ROW()),'Configuration Liste élèves'!$Q$7)+COUNTIF(INDIRECT(\"G\"&ROW()):INDIRECT(\"WH\"&ROW()),'Configuration Liste élèves'!$Q$8)+2*(COUNTIF(INDIRECT(\"G\"&ROW()):INDIRECT(\"WH\"&ROW()),'Configuration Liste élèves'!$Q$9)))))","v":""}]
[null,{"$f":"IF(A21=\"\",\"\",'Configuration Liste élèves'!B66)","v":""},{"$f":"IF(B21=\"\",\"\",'Configuration Liste élèves'!C66)","v":""},null,{"$f":"IF(B21=\"\",\"\",COUNTIF(INDIRECT(\"G\"&ROW()):INDIRECT(\"WH\"&ROW()),'Configuration Liste élèves'!$Q$5))","v":""},{"$f":"IF(B21=\"\",\"\",COUNTIF(INDIRECT(\"G\"&ROW()):INDIRECT(\"WH\"&ROW()),'Configuration Liste élèves'!$Q$2)+COUNTIF(INDIRECT(\"G\"&ROW()):INDIRECT(\"WH\"&ROW()),'Configuration Liste élèves'!$Q$3)+2*(COUNTIF(INDIRECT(\"G\"&ROW()):INDIRECT(\"WH\"&ROW()),'Configuration Liste élèves'!$Q$4+COUNTIF(INDIRECT(\"G\"&ROW()):INDIRECT(\"WH\"&ROW()),'Configuration Liste élèves'!$Q$7)+COUNTIF(INDIRECT(\"G\"&ROW()):INDIRECT(\"WH\"&ROW()),'Configuration Liste élèves'!$Q$8)+2*(COUNTIF(INDIRECT(\"G\"&ROW()):INDIRECT(\"WH\"&ROW()),'Configuration Liste élèves'!$Q$9)))))","v":""}]
[null,{"$f":"IF(A22=\"\",\"\",'Configuration Liste élèves'!B67)","v":""},{"$f":"IF(B22=\"\",\"\",'Configuration Liste élèves'!C67)","v":""},null,{"$f":"IF(B22=\"\",\"\",COUNTIF(INDIRECT(\"G\"&ROW()):INDIRECT(\"WH\"&ROW()),'Configuration Liste élèves'!$Q$5))","v":""},{"$f":"IF(B22=\"\",\"\",COUNTIF(INDIRECT(\"G\"&ROW()):INDIRECT(\"WH\"&ROW()),'Configuration Liste élèves'!$Q$2)+COUNTIF(INDIRECT(\"G\"&ROW()):INDIRECT(\"WH\"&ROW()),'Configuration Liste élèves'!$Q$3)+2*(COUNTIF(INDIRECT(\"G\"&ROW()):INDIRECT(\"WH\"&ROW()),'Configuration Liste élèves'!$Q$4+COUNTIF(INDIRECT(\"G\"&ROW()):INDIRECT(\"WH\"&ROW()),'Configuration Liste élèves'!$Q$7)+COUNTIF(INDIRECT(\"G\"&ROW()):INDIRECT(\"WH\"&ROW()),'Configuration Liste élèves'!$Q$8)+2*(COUNTIF(INDIRECT(\"G\"&ROW()):INDIRECT(\"WH\"&ROW()),'Configuration Liste élèves'!$Q$9)))))","v":""}]
[null,{"$f":"IF(A23=\"\",\"\",'Configuration Liste élèves'!B68)","v":""},{"$f":"IF(B23=\"\",\"\",'Configuration Liste élèves'!C68)","v":""},null,{"$f":"IF(B23=\"\",\"\",COUNTIF(INDIRECT(\"G\"&ROW()):INDIRECT(\"WH\"&ROW()),'Configuration Liste élèves'!$Q$5))","v":""},{"$f":"IF(B23=\"\",\"\",COUNTIF(INDIRECT(\"G\"&ROW()):INDIRECT(\"WH\"&ROW()),'Configuration Liste élèves'!$Q$2)+COUNTIF(INDIRECT(\"G\"&ROW()):INDIRECT(\"WH\"&ROW()),'Configuration Liste élèves'!$Q$3)+2*(COUNTIF(INDIRECT(\"G\"&ROW()):INDIRECT(\"WH\"&ROW()),'Configuration Liste élèves'!$Q$4+COUNTIF(INDIRECT(\"G\"&ROW()):INDIRECT(\"WH\"&ROW()),'Configuration Liste élèves'!$Q$7)+COUNTIF(INDIRECT(\"G\"&ROW()):INDIRECT(\"WH\"&ROW()),'Configuration Liste élèves'!$Q$8)+2*(COUNTIF(INDIRECT(\"G\"&ROW()):INDIRECT(\"WH\"&ROW()),'Configuration Liste élèves'!$Q$9)))))","v":""}]
[null,{"$f":"IF(A24=\"\",\"\",'Configuration Liste élèves'!B69)","v":""},{"$f":"IF(B24=\"\",\"\",'Configuration Liste élèves'!C69)","v":""},null,{"$f":"IF(B24=\"\",\"\",COUNTIF(INDIRECT(\"G\"&ROW()):INDIRECT(\"WH\"&ROW()),'Configuration Liste élèves'!$Q$5))","v":""},{"$f":"IF(B24=\"\",\"\",COUNTIF(INDIRECT(\"G\"&ROW()):INDIRECT(\"WH\"&ROW()),'Configuration Liste élèves'!$Q$2)+COUNTIF(INDIRECT(\"G\"&ROW()):INDIRECT(\"WH\"&ROW()),'Configuration Liste élèves'!$Q$3)+2*(COUNTIF(INDIRECT(\"G\"&ROW()):INDIRECT(\"WH\"&ROW()),'Configuration Liste élèves'!$Q$4+COUNTIF(INDIRECT(\"G\"&ROW()):INDIRECT(\"WH\"&ROW()),'Configuration Liste élèves'!$Q$7)+COUNTIF(INDIRECT(\"G\"&ROW()):INDIRECT(\"WH\"&ROW()),'Configuration Liste élèves'!$Q$8)+2*(COUNTIF(INDIRECT(\"G\"&ROW()):INDIRECT(\"WH\"&ROW()),'Configuration Liste élèves'!$Q$9)))))","v":""}]
[null,{"$f":"IF(A25=\"\",\"\",'Configuration Liste élèves'!B70)","v":""},{"$f":"IF(B25=\"\",\"\",'Configuration Liste élèves'!C70)","v":""},null,{"$f":"IF(B25=\"\",\"\",COUNTIF(INDIRECT(\"G\"&ROW()):INDIRECT(\"WH\"&ROW()),'Configuration Liste élèves'!$Q$5))","v":""},{"$f":"IF(B25=\"\",\"\",COUNTIF(INDIRECT(\"G\"&ROW()):INDIRECT(\"WH\"&ROW()),'Configuration Liste élèves'!$Q$2)+COUNTIF(INDIRECT(\"G\"&ROW()):INDIRECT(\"WH\"&ROW()),'Configuration Liste élèves'!$Q$3)+2*(COUNTIF(INDIRECT(\"G\"&ROW()):INDIRECT(\"WH\"&ROW()),'Configuration Liste élèves'!$Q$4+COUNTIF(INDIRECT(\"G\"&ROW()):INDIRECT(\"WH\"&ROW()),'Configuration Liste élèves'!$Q$7)+COUNTIF(INDIRECT(\"G\"&ROW()):INDIRECT(\"WH\"&ROW()),'Configuration Liste élèves'!$Q$8)+2*(COUNTIF(INDIRECT(\"G\"&ROW()):INDIRECT(\"WH\"&ROW()),'Configuration Liste élèves'!$Q$9)))))","v":""}]
[null,{"$f":"IF(A26=\"\",\"\",'Configuration Liste élèves'!B71)","v":""},{"$f":"IF(B26=\"\",\"\",'Configuration Liste élèves'!C71)","v":""},null,{"$f":"IF(B26=\"\",\"\",COUNTIF(INDIRECT(\"G\"&ROW()):INDIRECT(\"WH\"&ROW()),'Configuration Liste élèves'!$Q$5))","v":""},{"$f":"IF(B26=\"\",\"\",COUNTIF(INDIRECT(\"G\"&ROW()):INDIRECT(\"WH\"&ROW()),'Configuration Liste élèves'!$Q$2)+COUNTIF(INDIRECT(\"G\"&ROW()):INDIRECT(\"WH\"&ROW()),'Configuration Liste élèves'!$Q$3)+2*(COUNTIF(INDIRECT(\"G\"&ROW()):INDIRECT(\"WH\"&ROW()),'Configuration Liste élèves'!$Q$4+COUNTIF(INDIRECT(\"G\"&ROW()):INDIRECT(\"WH\"&ROW()),'Configuration Liste élèves'!$Q$7)+COUNTIF(INDIRECT(\"G\"&ROW()):INDIRECT(\"WH\"&ROW()),'Configuration Liste élèves'!$Q$8)+2*(COUNTIF(INDIRECT(\"G\"&ROW()):INDIRECT(\"WH\"&ROW()),'Configuration Liste élèves'!$Q$9)))))","v":""}]
[null,{"$f":"IF(A27=\"\",\"\",'Configuration Liste élèves'!B72)","v":""},{"$f":"IF(B27=\"\",\"\",'Configuration Liste élèves'!C72)","v":""},null,{"$f":"IF(B27=\"\",\"\",COUNTIF(INDIRECT(\"G\"&ROW()):INDIRECT(\"WH\"&ROW()),'Configuration Liste élèves'!$Q$5))","v":""},{"$f":"IF(B27=\"\",\"\",COUNTIF(INDIRECT(\"G\"&ROW()):INDIRECT(\"WH\"&ROW()),'Configuration Liste élèves'!$Q$2)+COUNTIF(INDIRECT(\"G\"&ROW()):INDIRECT(\"WH\"&ROW()),'Configuration Liste élèves'!$Q$3)+2*(COUNTIF(INDIRECT(\"G\"&ROW()):INDIRECT(\"WH\"&ROW()),'Configuration Liste élèves'!$Q$4+COUNTIF(INDIRECT(\"G\"&ROW()):INDIRECT(\"WH\"&ROW()),'Configuration Liste élèves'!$Q$7)+COUNTIF(INDIRECT(\"G\"&ROW()):INDIRECT(\"WH\"&ROW()),'Configuration Liste élèves'!$Q$8)+2*(COUNTIF(INDIRECT(\"G\"&ROW()):INDIRECT(\"WH\"&ROW()),'Configuration Liste élèves'!$Q$9)))))","v":""}]
[null,{"$f":"IF(A28=\"\",\"\",'Configuration Liste élèves'!B73)","v":""},{"$f":"IF(B28=\"\",\"\",'Configuration Liste élèves'!C73)","v":""},null,{"$f":"IF(B28=\"\",\"\",COUNTIF(INDIRECT(\"G\"&ROW()):INDIRECT(\"WH\"&ROW()),'Configuration Liste élèves'!$Q$5))","v":""},{"$f":"IF(B28=\"\",\"\",COUNTIF(INDIRECT(\"G\"&ROW()):INDIRECT(\"WH\"&ROW()),'Configuration Liste élèves'!$Q$2)+COUNTIF(INDIRECT(\"G\"&ROW()):INDIRECT(\"WH\"&ROW()),'Configuration Liste élèves'!$Q$3)+2*(COUNTIF(INDIRECT(\"G\"&ROW()):INDIRECT(\"WH\"&ROW()),'Configuration Liste élèves'!$Q$4+COUNTIF(INDIRECT(\"G\"&ROW()):INDIRECT(\"WH\"&ROW()),'Configuration Liste élèves'!$Q$7)+COUNTIF(INDIRECT(\"G\"&ROW()):INDIRECT(\"WH\"&ROW()),'Configuration Liste élèves'!$Q$8)+2*(COUNTIF(INDIRECT(\"G\"&ROW()):INDIRECT(\"WH\"&ROW()),'Configuration Liste élèves'!$Q$9)))))","v":""}]
[null,{"$f":"IF(A29=\"\",\"\",'Configuration Liste élèves'!B74)","v":""},{"$f":"IF(B29=\"\",\"\",'Configuration Liste élèves'!C74)","v":""},null,{"$f":"IF(B29=\"\",\"\",COUNTIF(INDIRECT(\"G\"&ROW()):INDIRECT(\"WH\"&ROW()),'Configuration Liste élèves'!$Q$5))","v":""},{"$f":"IF(B29=\"\",\"\",COUNTIF(INDIRECT(\"G\"&ROW()):INDIRECT(\"WH\"&ROW()),'Configuration Liste élèves'!$Q$2)+COUNTIF(INDIRECT(\"G\"&ROW()):INDIRECT(\"WH\"&ROW()),'Configuration Liste élèves'!$Q$3)+2*(COUNTIF(INDIRECT(\"G\"&ROW()):INDIRECT(\"WH\"&ROW()),'Configuration Liste élèves'!$Q$4+COUNTIF(INDIRECT(\"G\"&ROW()):INDIRECT(\"WH\"&ROW()),'Configuration Liste élèves'!$Q$7)+COUNTIF(INDIRECT(\"G\"&ROW()):INDIRECT(\"WH\"&ROW()),'Configuration Liste élèves'!$Q$8)+2*(COUNTIF(INDIRECT(\"G\"&ROW()):INDIRECT(\"WH\"&ROW()),'Configuration Liste élèves'!$Q$9)))))","v":""}]
[null,{"$f":"IF(A30=\"\",\"\",'Configuration Liste élèves'!B75)","v":""},{"$f":"IF(B30=\"\",\"\",'Configuration Liste élèves'!C75)","v":""},null,{"$f":"IF(B30=\"\",\"\",COUNTIF(INDIRECT(\"G\"&ROW()):INDIRECT(\"WH\"&ROW()),'Configuration Liste élèves'!$Q$5))","v":""},{"$f":"IF(B30=\"\",\"\",COUNTIF(INDIRECT(\"G\"&ROW()):INDIRECT(\"WH\"&ROW()),'Configuration Liste élèves'!$Q$2)+COUNTIF(INDIRECT(\"G\"&ROW()):INDIRECT(\"WH\"&ROW()),'Configuration Liste élèves'!$Q$3)+2*(COUNTIF(INDIRECT(\"G\"&ROW()):INDIRECT(\"WH\"&ROW()),'Configuration Liste élèves'!$Q$4+COUNTIF(INDIRECT(\"G\"&ROW()):INDIRECT(\"WH\"&ROW()),'Configuration Liste élèves'!$Q$7)+COUNTIF(INDIRECT(\"G\"&ROW()):INDIRECT(\"WH\"&ROW()),'Configuration Liste élèves'!$Q$8)+2*(COUNTIF(INDIRECT(\"G\"&ROW()):INDIRECT(\"WH\"&ROW()),'Configuration Liste élèves'!$Q$9)))))","v":""}]
[null,{"$f":"IF(A31=\"\",\"\",'Configuration Liste élèves'!B76)","v":""},{"$f":"IF(B31=\"\",\"\",'Configuration Liste élèves'!C76)","v":""},null,{"$f":"IF(B31=\"\",\"\",COUNTIF(INDIRECT(\"G\"&ROW()):INDIRECT(\"WH\"&ROW()),'Configuration Liste élèves'!$Q$5))","v":""},{"$f":"IF(B31=\"\",\"\",COUNTIF(INDIRECT(\"G\"&ROW()):INDIRECT(\"WH\"&ROW()),'Configuration Liste élèves'!$Q$2)+COUNTIF(INDIRECT(\"G\"&ROW()):INDIRECT(\"WH\"&ROW()),'Configuration Liste élèves'!$Q$3)+2*(COUNTIF(INDIRECT(\"G\"&ROW()):INDIRECT(\"WH\"&ROW()),'Configuration Liste élèves'!$Q$4+COUNTIF(INDIRECT(\"G\"&ROW()):INDIRECT(\"WH\"&ROW()),'Configuration Liste élèves'!$Q$7)+COUNTIF(INDIRECT(\"G\"&ROW()):INDIRECT(\"WH\"&ROW()),'Configuration Liste élèves'!$Q$8)+2*(COUNTIF(INDIRECT(\"G\"&ROW()):INDIRECT(\"WH\"&ROW()),'Configuration Liste élèves'!$Q$9)))))","v":""}]
[null,{"$f":"IF(A32=\"\",\"\",'Configuration Liste élèves'!B77)","v":""},{"$f":"IF(B32=\"\",\"\",'Configuration Liste élèves'!C77)","v":""},null,{"$f":"IF(B32=\"\",\"\",COUNTIF(INDIRECT(\"G\"&ROW()):INDIRECT(\"WH\"&ROW()),'Configuration Liste élèves'!$Q$5))","v":""},{"$f":"IF(B32=\"\",\"\",COUNTIF(INDIRECT(\"G\"&ROW()):INDIRECT(\"WH\"&ROW()),'Configuration Liste élèves'!$Q$2)+COUNTIF(INDIRECT(\"G\"&ROW()):INDIRECT(\"WH\"&ROW()),'Configuration Liste élèves'!$Q$3)+2*(COUNTIF(INDIRECT(\"G\"&ROW()):INDIRECT(\"WH\"&ROW()),'Configuration Liste élèves'!$Q$4+COUNTIF(INDIRECT(\"G\"&ROW()):INDIRECT(\"WH\"&ROW()),'Configuration Liste élèves'!$Q$7)+COUNTIF(INDIRECT(\"G\"&ROW()):INDIRECT(\"WH\"&ROW()),'Configuration Liste élèves'!$Q$8)+2*(COUNTIF(INDIRECT(\"G\"&ROW()):INDIRECT(\"WH\"&ROW()),'Configuration Liste élèves'!$Q$9)))))","v":""}]
[null,{"$f":"IF(A33=\"\",\"\",'Configuration Liste élèves'!B78)","v":""},{"$f":"IF(B33=\"\",\"\",'Configuration Liste élèves'!C78)","v":""},null,{"$f":"IF(B33=\"\",\"\",COUNTIF(INDIRECT(\"G\"&ROW()):INDIRECT(\"WH\"&ROW()),'Configuration Liste élèves'!$Q$5))","v":""},{"$f":"IF(B33=\"\",\"\",COUNTIF(INDIRECT(\"G\"&ROW()):INDIRECT(\"WH\"&ROW()),'Configuration Liste élèves'!$Q$2)+COUNTIF(INDIRECT(\"G\"&ROW()):INDIRECT(\"WH\"&ROW()),'Configuration Liste élèves'!$Q$3)+2*(COUNTIF(INDIRECT(\"G\"&ROW()):INDIRECT(\"WH\"&ROW()),'Configuration Liste élèves'!$Q$4+COUNTIF(INDIRECT(\"G\"&ROW()):INDIRECT(\"WH\"&ROW()),'Configuration Liste élèves'!$Q$7)+COUNTIF(INDIRECT(\"G\"&ROW()):INDIRECT(\"WH\"&ROW()),'Configuration Liste élèves'!$Q$8)+2*(COUNTIF(INDIRECT(\"G\"&ROW()):INDIRECT(\"WH\"&ROW()),'Configuration Liste élèves'!$Q$9)))))","v":""}]
[null,{"$f":"IF(A34=\"\",\"\",'Configuration Liste élèves'!B79)","v":""},{"$f":"IF(B34=\"\",\"\",'Configuration Liste élèves'!C79)","v":""},null,{"$f":"IF(B34=\"\",\"\",COUNTIF(INDIRECT(\"G\"&ROW()):INDIRECT(\"WH\"&ROW()),'Configuration Liste élèves'!$Q$5))","v":""},{"$f":"IF(B34=\"\",\"\",COUNTIF(INDIRECT(\"G\"&ROW()):INDIRECT(\"WH\"&ROW()),'Configuration Liste élèves'!$Q$2)+COUNTIF(INDIRECT(\"G\"&ROW()):INDIRECT(\"WH\"&ROW()),'Configuration Liste élèves'!$Q$3)+2*(COUNTIF(INDIRECT(\"G\"&ROW()):INDIRECT(\"WH\"&ROW()),'Configuration Liste élèves'!$Q$4+COUNTIF(INDIRECT(\"G\"&ROW()):INDIRECT(\"WH\"&ROW()),'Configuration Liste élèves'!$Q$7)+COUNTIF(INDIRECT(\"G\"&ROW()):INDIRECT(\"WH\"&ROW()),'Configuration Liste élèves'!$Q$8)+2*(COUNTIF(INDIRECT(\"G\"&ROW()):INDIRECT(\"WH\"&ROW()),'Configuration Liste élèves'!$Q$9)))))","v":""}]
[null,{"$f":"IF(A35=\"\",\"\",'Configuration Liste élèves'!B80)","v":""},{"$f":"IF(B35=\"\",\"\",'Configuration Liste élèves'!C80)","v":""},null,{"$f":"IF(B35=\"\",\"\",COUNTIF(INDIRECT(\"G\"&ROW()):INDIRECT(\"WH\"&ROW()),'Configuration Liste élèves'!$Q$5))","v":""},{"$f":"IF(B35=\"\",\"\",COUNTIF(INDIRECT(\"G\"&ROW()):INDIRECT(\"WH\"&ROW()),'Configuration Liste élèves'!$Q$2)+COUNTIF(INDIRECT(\"G\"&ROW()):INDIRECT(\"WH\"&ROW()),'Configuration Liste élèves'!$Q$3)+2*(COUNTIF(INDIRECT(\"G\"&ROW()):INDIRECT(\"WH\"&ROW()),'Configuration Liste élèves'!$Q$4+COUNTIF(INDIRECT(\"G\"&ROW()):INDIRECT(\"WH\"&ROW()),'Configuration Liste élèves'!$Q$7)+COUNTIF(INDIRECT(\"G\"&ROW()):INDIRECT(\"WH\"&ROW()),'Configuration Liste élèves'!$Q$8)+2*(COUNTIF(INDIRECT(\"G\"&ROW()):INDIRECT(\"WH\"&ROW()),'Configuration Liste élèves'!$Q$9)))))","v":""}]
[null,{"$f":"IF(A36=\"\",\"\",'Configuration Liste élèves'!B81)","v":""},{"$f":"IF(B36=\"\",\"\",'Configuration Liste élèves'!C81)","v":""},null,{"$f":"IF(B36=\"\",\"\",COUNTIF(INDIRECT(\"G\"&ROW()):INDIRECT(\"WH\"&ROW()),'Configuration Liste élèves'!$Q$5))","v":""},{"$f":"IF(B36=\"\",\"\",COUNTIF(INDIRECT(\"G\"&ROW()):INDIRECT(\"WH\"&ROW()),'Configuration Liste élèves'!$Q$2)+COUNTIF(INDIRECT(\"G\"&ROW()):INDIRECT(\"WH\"&ROW()),'Configuration Liste élèves'!$Q$3)+2*(COUNTIF(INDIRECT(\"G\"&ROW()):INDIRECT(\"WH\"&ROW()),'Configuration Liste élèves'!$Q$4+COUNTIF(INDIRECT(\"G\"&ROW()):INDIRECT(\"WH\"&ROW()),'Configuration Liste élèves'!$Q$7)+COUNTIF(INDIRECT(\"G\"&ROW()):INDIRECT(\"WH\"&ROW()),'Configuration Liste élèves'!$Q$8)+2*(COUNTIF(INDIRECT(\"G\"&ROW()):INDIRECT(\"WH\"&ROW()),'Configuration Liste élèves'!$Q$9)))))","v":""}]
[null,{"$f":"IF(A37=\"\",\"\",'Configuration Liste élèves'!B82)","v":""},{"$f":"IF(B37=\"\",\"\",'Configuration Liste élèves'!C82)","v":""},null,{"$f":"IF(B37=\"\",\"\",COUNTIF(INDIRECT(\"G\"&ROW()):INDIRECT(\"WH\"&ROW()),'Configuration Liste élèves'!$Q$5))","v":""},{"$f":"IF(B37=\"\",\"\",COUNTIF(INDIRECT(\"G\"&ROW()):INDIRECT(\"WH\"&ROW()),'Configuration Liste élèves'!$Q$2)+COUNTIF(INDIRECT(\"G\"&ROW()):INDIRECT(\"WH\"&ROW()),'Configuration Liste élèves'!$Q$3)+2*(COUNTIF(INDIRECT(\"G\"&ROW()):INDIRECT(\"WH\"&ROW()),'Configuration Liste élèves'!$Q$4+COUNTIF(INDIRECT(\"G\"&ROW()):INDIRECT(\"WH\"&ROW()),'Configuration Liste élèves'!$Q$7)+COUNTIF(INDIRECT(\"G\"&ROW()):INDIRECT(\"WH\"&ROW()),'Configuration Liste élèves'!$Q$8)+2*(COUNTIF(INDIRECT(\"G\"&ROW()):INDIRECT(\"WH\"&ROW()),'Configuration Liste élèves'!$Q$9)))))","v":""}]
[null,{"$f":"IF(A38=\"\",\"\",'Configuration Liste élèves'!B83)","v":""},{"$f":"IF(B38=\"\",\"\",'Configuration Liste élèves'!C83)","v":""},null,{"$f":"IF(B38=\"\",\"\",COUNTIF(INDIRECT(\"G\"&ROW()):INDIRECT(\"WH\"&ROW()),'Configuration Liste élèves'!$Q$5))","v":""},{"$f":"IF(B38=\"\",\"\",COUNTIF(INDIRECT(\"G\"&ROW()):INDIRECT(\"WH\"&ROW()),'Configuration Liste élèves'!$Q$2)+COUNTIF(INDIRECT(\"G\"&ROW()):INDIRECT(\"WH\"&ROW()),'Configuration Liste élèves'!$Q$3)+2*(COUNTIF(INDIRECT(\"G\"&ROW()):INDIRECT(\"WH\"&ROW()),'Configuration Liste élèves'!$Q$4+COUNTIF(INDIRECT(\"G\"&ROW()):INDIRECT(\"WH\"&ROW()),'Configuration Liste élèves'!$Q$7)+COUNTIF(INDIRECT(\"G\"&ROW()):INDIRECT(\"WH\"&ROW()),'Configuration Liste élèves'!$Q$8)+2*(COUNTIF(INDIRECT(\"G\"&ROW()):INDIRECT(\"WH\"&ROW()),'Configuration Liste élèves'!$Q$9)))))","v":""}]
[null,{"$f":"IF(A39=\"\",\"\",'Configuration Liste élèves'!B84)","v":""},{"$f":"IF(B39=\"\",\"\",'Configuration Liste élèves'!C84)","v":""},null,{"$f":"IF(B39=\"\",\"\",COUNTIF(INDIRECT(\"G\"&ROW()):INDIRECT(\"WH\"&ROW()),'Configuration Liste élèves'!$Q$5))","v":""},{"$f":"IF(B39=\"\",\"\",COUNTIF(INDIRECT(\"G\"&ROW()):INDIRECT(\"WH\"&ROW()),'Configuration Liste élèves'!$Q$2)+COUNTIF(INDIRECT(\"G\"&ROW()):INDIRECT(\"WH\"&ROW()),'Configuration Liste élèves'!$Q$3)+2*(COUNTIF(INDIRECT(\"G\"&ROW()):INDIRECT(\"WH\"&ROW()),'Configuration Liste élèves'!$Q$4+COUNTIF(INDIRECT(\"G\"&ROW()):INDIRECT(\"WH\"&ROW()),'Configuration Liste élèves'!$Q$7)+COUNTIF(INDIRECT(\"G\"&ROW()):INDIRECT(\"WH\"&ROW()),'Configuration Liste élèves'!$Q$8)+2*(COUNTIF(INDIRECT(\"G\"&ROW()):INDIRECT(\"WH\"&ROW()),'Configuration Liste élèves'!$Q$9)))))","v":""}]
[null,{"$f":"IF(A40=\"\",\"\",'Configuration Liste élèves'!B85)","v":""},{"$f":"IF(B40=\"\",\"\",'Configuration Liste élèves'!C85)","v":""},null,{"$f":"IF(B40=\"\",\"\",COUNTIF(INDIRECT(\"G\"&ROW()):INDIRECT(\"WH\"&ROW()),'Configuration Liste élèves'!$Q$5))","v":""},{"$f":"IF(B40=\"\",\"\",COUNTIF(INDIRECT(\"G\"&ROW()):INDIRECT(\"WH\"&ROW()),'Configuration Liste élèves'!$Q$2)+COUNTIF(INDIRECT(\"G\"&ROW()):INDIRECT(\"WH\"&ROW()),'Configuration Liste élèves'!$Q$3)+2*(COUNTIF(INDIRECT(\"G\"&ROW()):INDIRECT(\"WH\"&ROW()),'Configuration Liste élèves'!$Q$4+COUNTIF(INDIRECT(\"G\"&ROW()):INDIRECT(\"WH\"&ROW()),'Configuration Liste élèves'!$Q$7)+COUNTIF(INDIRECT(\"G\"&ROW()):INDIRECT(\"WH\"&ROW()),'Configuration Liste élèves'!$Q$8)+2*(COUNTIF(INDIRECT(\"G\"&ROW()):INDIRECT(\"WH\"&ROW()),'Configuration Liste élèves'!$Q$9)))))","v":""}]
[null,{"$f":"IF(A41=\"\",\"\",'Configuration Liste élèves'!B86)","v":""},{"$f":"IF(B41=\"\",\"\",'Configuration Liste élèves'!C86)","v":""},null,{"$f":"IF(B41=\"\",\"\",COUNTIF(INDIRECT(\"G\"&ROW()):INDIRECT(\"WH\"&ROW()),'Configuration Liste élèves'!$Q$5))","v":""},{"$f":"IF(B41=\"\",\"\",COUNTIF(INDIRECT(\"G\"&ROW()):INDIRECT(\"WH\"&ROW()),'Configuration Liste élèves'!$Q$2)+COUNTIF(INDIRECT(\"G\"&ROW()):INDIRECT(\"WH\"&ROW()),'Configuration Liste élèves'!$Q$3)+2*(COUNTIF(INDIRECT(\"G\"&ROW()):INDIRECT(\"WH\"&ROW()),'Configuration Liste élèves'!$Q$4+COUNTIF(INDIRECT(\"G\"&ROW()):INDIRECT(\"WH\"&ROW()),'Configuration Liste élèves'!$Q$7)+COUNTIF(INDIRECT(\"G\"&ROW()):INDIRECT(\"WH\"&ROW()),'Configuration Liste élèves'!$Q$8)+2*(COUNTIF(INDIRECT(\"G\"&ROW()):INDIRECT(\"WH\"&ROW()),'Configuration Liste élèves'!$Q$9)))))","v":""}]
[null,{"$f":"IF(A42=\"\",\"\",'Configuration Liste élèves'!B87)","v":""},{"$f":"IF(B42=\"\",\"\",'Configuration Liste élèves'!C87)","v":""},null,{"$f":"IF(B42=\"\",\"\",COUNTIF(INDIRECT(\"G\"&ROW()):INDIRECT(\"WH\"&ROW()),'Configuration Liste élèves'!$Q$5))","v":""},{"$f":"IF(B42=\"\",\"\",COUNTIF(INDIRECT(\"G\"&ROW()):INDIRECT(\"WH\"&ROW()),'Configuration Liste élèves'!$Q$2)+COUNTIF(INDIRECT(\"G\"&ROW()):INDIRECT(\"WH\"&ROW()),'Configuration Liste élèves'!$Q$3)+2*(COUNTIF(INDIRECT(\"G\"&ROW()):INDIRECT(\"WH\"&ROW()),'Configuration Liste élèves'!$Q$4+COUNTIF(INDIRECT(\"G\"&ROW()):INDIRECT(\"WH\"&ROW()),'Configuration Liste élèves'!$Q$7)+COUNTIF(INDIRECT(\"G\"&ROW()):INDIRECT(\"WH\"&ROW()),'Configuration Liste élèves'!$Q$8)+2*(COUNTIF(INDIRECT(\"G\"&ROW()):INDIRECT(\"WH\"&ROW()),'Configuration Liste élèves'!$Q$9)))))","v":""}]
[null,{"$f":"IF(A43=\"\",\"\",'Configuration Liste élèves'!B88)","v":""},{"$f":"IF(B43=\"\",\"\",'Configuration Liste élèves'!C88)","v":""},null,{"$f":"IF(B43=\"\",\"\",COUNTIF(INDIRECT(\"G\"&ROW()):INDIRECT(\"WH\"&ROW()),'Configuration Liste élèves'!$Q$5))","v":""},{"$f":"IF(B43=\"\",\"\",COUNTIF(INDIRECT(\"G\"&ROW()):INDIRECT(\"WH\"&ROW()),'Configuration Liste élèves'!$Q$2)+COUNTIF(INDIRECT(\"G\"&ROW()):INDIRECT(\"WH\"&ROW()),'Configuration Liste élèves'!$Q$3)+2*(COUNTIF(INDIRECT(\"G\"&ROW()):INDIRECT(\"WH\"&ROW()),'Configuration Liste élèves'!$Q$4+COUNTIF(INDIRECT(\"G\"&ROW()):INDIRECT(\"WH\"&ROW()),'Configuration Liste élèves'!$Q$7)+COUNTIF(INDIRECT(\"G\"&ROW()):INDIRECT(\"WH\"&ROW()),'Configuration Liste élèves'!$Q$8)+2*(COUNTIF(INDIRECT(\"G\"&ROW()):INDIRECT(\"WH\"&ROW()),'Configuration Liste élèves'!$Q$9)))))","v":""}]
[null,{"$f":"IF(A44=\"\",\"\",'Configuration Liste élèves'!B89)","v":""},{"$f":"IF(B44=\"\",\"\",'Configuration Liste élèves'!C89)","v":""},null,{"$f":"IF(B44=\"\",\"\",COUNTIF(INDIRECT(\"G\"&ROW()):INDIRECT(\"WH\"&ROW()),'Configuration Liste élèves'!$Q$5))","v":""},{"$f":"IF(B44=\"\",\"\",COUNTIF(INDIRECT(\"G\"&ROW()):INDIRECT(\"WH\"&ROW()),'Configuration Liste élèves'!$Q$2)+COUNTIF(INDIRECT(\"G\"&ROW()):INDIRECT(\"WH\"&ROW()),'Configuration Liste élèves'!$Q$3)+2*(COUNTIF(INDIRECT(\"G\"&ROW()):INDIRECT(\"WH\"&ROW()),'Configuration Liste élèves'!$Q$4+COUNTIF(INDIRECT(\"G\"&ROW()):INDIRECT(\"WH\"&ROW()),'Configuration Liste élèves'!$Q$7)+COUNTIF(INDIRECT(\"G\"&ROW()):INDIRECT(\"WH\"&ROW()),'Configuration Liste élèves'!$Q$8)+2*(COUNTIF(INDIRECT(\"G\"&ROW()):INDIRECT(\"WH\"&ROW()),'Configuration Liste élèves'!$Q$9)))))","v":""}]
[null,{"$f":"IF(A45=\"\",\"\",'Configuration Liste élèves'!B90)","v":""},{"$f":"IF(B45=\"\",\"\",'Configuration Liste élèves'!C90)","v":""},null,{"$f":"IF(B45=\"\",\"\",COUNTIF(INDIRECT(\"G\"&ROW()):INDIRECT(\"WH\"&ROW()),'Configuration Liste élèves'!$Q$5))","v":""},{"$f":"IF(B45=\"\",\"\",COUNTIF(INDIRECT(\"G\"&ROW()):INDIRECT(\"WH\"&ROW()),'Configuration Liste élèves'!$Q$2)+COUNTIF(INDIRECT(\"G\"&ROW()):INDIRECT(\"WH\"&ROW()),'Configuration Liste élèves'!$Q$3)+2*(COUNTIF(INDIRECT(\"G\"&ROW()):INDIRECT(\"WH\"&ROW()),'Configuration Liste élèves'!$Q$4+COUNTIF(INDIRECT(\"G\"&ROW()):INDIRECT(\"WH\"&ROW()),'Configuration Liste élèves'!$Q$7)+COUNTIF(INDIRECT(\"G\"&ROW()):INDIRECT(\"WH\"&ROW()),'Configuration Liste élèves'!$Q$8)+2*(COUNTIF(INDIRECT(\"G\"&ROW()):INDIRECT(\"WH\"&ROW()),'Configuration Liste élèves'!$Q$9)))))","v":""}]
[null,{"$f":"IF(A46=\"\",\"\",'Configuration Liste élèves'!B91)","v":""},{"$f":"IF(B46=\"\",\"\",'Configuration Liste élèves'!C91)","v":""},null,{"$f":"IF(B46=\"\",\"\",COUNTIF(INDIRECT(\"G\"&ROW()):INDIRECT(\"WH\"&ROW()),'Configuration Liste élèves'!$Q$5))","v":""},{"$f":"IF(B46=\"\",\"\",COUNTIF(INDIRECT(\"G\"&ROW()):INDIRECT(\"WH\"&ROW()),'Configuration Liste élèves'!$Q$2)+COUNTIF(INDIRECT(\"G\"&ROW()):INDIRECT(\"WH\"&ROW()),'Configuration Liste élèves'!$Q$3)+2*(COUNTIF(INDIRECT(\"G\"&ROW()):INDIRECT(\"WH\"&ROW()),'Configuration Liste élèves'!$Q$4+COUNTIF(INDIRECT(\"G\"&ROW()):INDIRECT(\"WH\"&ROW()),'Configuration Liste élèves'!$Q$7)+COUNTIF(INDIRECT(\"G\"&ROW()):INDIRECT(\"WH\"&ROW()),'Configuration Liste élèves'!$Q$8)+2*(COUNTIF(INDIRECT(\"G\"&ROW()):INDIRECT(\"WH\"&ROW()),'Configuration Liste élèves'!$Q$9)))))","v":""}]
[null,{"$f":"IF(A47=\"\",\"\",'Configuration Liste élèves'!B92)","v":""},{"$f":"IF(B47=\"\",\"\",'Configuration Liste élèves'!C92)","v":""},null,{"$f":"IF(B47=\"\",\"\",COUNTIF(INDIRECT(\"G\"&ROW()):INDIRECT(\"WH\"&ROW()),'Configuration Liste élèves'!$Q$5))","v":""},{"$f":"IF(B47=\"\",\"\",COUNTIF(INDIRECT(\"G\"&ROW()):INDIRECT(\"WH\"&ROW()),'Configuration Liste élèves'!$Q$2)+COUNTIF(INDIRECT(\"G\"&ROW()):INDIRECT(\"WH\"&ROW()),'Configuration Liste élèves'!$Q$3)+2*(COUNTIF(INDIRECT(\"G\"&ROW()):INDIRECT(\"WH\"&ROW()),'Configuration Liste élèves'!$Q$4+COUNTIF(INDIRECT(\"G\"&ROW()):INDIRECT(\"WH\"&ROW()),'Configuration Liste élèves'!$Q$7)+COUNTIF(INDIRECT(\"G\"&ROW()):INDIRECT(\"WH\"&ROW()),'Configuration Liste élèves'!$Q$8)+2*(COUNTIF(INDIRECT(\"G\"&ROW()):INDIRECT(\"WH\"&ROW()),'Configuration Liste élèves'!$Q$9)))))","v":""}]
[{"$f":"'Configuration Liste élèves'!A52","v":""},{"$f":"IF(A48=\"\",\"\",'Configuration Liste élèves'!B93)","v":""},{"$f":"IF(B48=\"\",\"\",'Configuration Liste élèves'!C93)","v":""},null,{"$f":"IF(B48=\"\",\"\",COUNTIF(INDIRECT(\"G\"&ROW()):INDIRECT(\"WH\"&ROW()),'Configuration Liste élèves'!$Q$5))","v":""},{"$f":"IF(B48=\"\",\"\",COUNTIF(INDIRECT(\"G\"&ROW()):INDIRECT(\"WH\"&ROW()),'Configuration Liste élèves'!$Q$2)+COUNTIF(INDIRECT(\"G\"&ROW()):INDIRECT(\"WH\"&ROW()),'Configuration Liste élèves'!$Q$3)+2*(COUNTIF(INDIRECT(\"G\"&ROW()):INDIRECT(\"WH\"&ROW()),'Configuration Liste élèves'!$Q$4+COUNTIF(INDIRECT(\"G\"&ROW()):INDIRECT(\"WH\"&ROW()),'Configuration Liste élèves'!$Q$7)+COUNTIF(INDIRECT(\"G\"&ROW()):INDIRECT(\"WH\"&ROW()),'Configuration Liste élèves'!$Q$8)+2*(COUNTIF(INDIRECT(\"G\"&ROW()):INDIRECT(\"WH\"&ROW()),'Configuration Liste élèves'!$Q$9)))))","v":""}]
[null,{"$f":"IF(A49=\"\",\"\",'Configuration Liste élèves'!B94)","v":""},{"$f":"IF(B49=\"\",\"\",'Configuration Liste élèves'!C94)","v":""},null,{"$f":"IF(B49=\"\",\"\",COUNTIF(INDIRECT(\"G\"&ROW()):INDIRECT(\"WH\"&ROW()),'Configuration Liste élèves'!$Q$5))","v":""},{"$f":"IF(B49=\"\",\"\",COUNTIF(INDIRECT(\"G\"&ROW()):INDIRECT(\"WH\"&ROW()),'Configuration Liste élèves'!$Q$2)+COUNTIF(INDIRECT(\"G\"&ROW()):INDIRECT(\"WH\"&ROW()),'Configuration Liste élèves'!$Q$3)+2*(COUNTIF(INDIRECT(\"G\"&ROW()):INDIRECT(\"WH\"&ROW()),'Configuration Liste élèves'!$Q$4+COUNTIF(INDIRECT(\"G\"&ROW()):INDIRECT(\"WH\"&ROW()),'Configuration Liste élèves'!$Q$7)+COUNTIF(INDIRECT(\"G\"&ROW()):INDIRECT(\"WH\"&ROW()),'Configuration Liste élèves'!$Q$8)+2*(COUNTIF(INDIRECT(\"G\"&ROW()):INDIRECT(\"WH\"&ROW()),'Configuration Liste élèves'!$Q$9)))))","v":""}]
[null,{"$f":"IF(A50=\"\",\"\",'Configuration Liste élèves'!B95)","v":""},{"$f":"IF(B50=\"\",\"\",'Configuration Liste élèves'!C95)","v":""},null,{"$f":"IF(B50=\"\",\"\",COUNTIF(INDIRECT(\"G\"&ROW()):INDIRECT(\"WH\"&ROW()),'Configuration Liste élèves'!$Q$5))","v":""},{"$f":"IF(B50=\"\",\"\",COUNTIF(INDIRECT(\"G\"&ROW()):INDIRECT(\"WH\"&ROW()),'Configuration Liste élèves'!$Q$2)+COUNTIF(INDIRECT(\"G\"&ROW()):INDIRECT(\"WH\"&ROW()),'Configuration Liste élèves'!$Q$3)+2*(COUNTIF(INDIRECT(\"G\"&ROW()):INDIRECT(\"WH\"&ROW()),'Configuration Liste élèves'!$Q$4+COUNTIF(INDIRECT(\"G\"&ROW()):INDIRECT(\"WH\"&ROW()),'Configuration Liste élèves'!$Q$7)+COUNTIF(INDIRECT(\"G\"&ROW()):INDIRECT(\"WH\"&ROW()),'Configuration Liste élèves'!$Q$8)+2*(COUNTIF(INDIRECT(\"G\"&ROW()):INDIRECT(\"WH\"&ROW()),'Configuration Liste élèves'!$Q$9)))))","v":""}]
[null,{"$f":"IF(A51=\"\",\"\",'Configuration Liste élèves'!B96)","v":""},{"$f":"IF(B51=\"\",\"\",'Configuration Liste élèves'!C96)","v":""},null,{"$f":"IF(B51=\"\",\"\",COUNTIF(INDIRECT(\"G\"&ROW()):INDIRECT(\"WH\"&ROW()),'Configuration Liste élèves'!$Q$5))","v":""},{"$f":"IF(B51=\"\",\"\",COUNTIF(INDIRECT(\"G\"&ROW()):INDIRECT(\"WH\"&ROW()),'Configuration Liste élèves'!$Q$2)+COUNTIF(INDIRECT(\"G\"&ROW()):INDIRECT(\"WH\"&ROW()),'Configuration Liste élèves'!$Q$3)+2*(COUNTIF(INDIRECT(\"G\"&ROW()):INDIRECT(\"WH\"&ROW()),'Configuration Liste élèves'!$Q$4+COUNTIF(INDIRECT(\"G\"&ROW()):INDIRECT(\"WH\"&ROW()),'Configuration Liste élèves'!$Q$7)+COUNTIF(INDIRECT(\"G\"&ROW()):INDIRECT(\"WH\"&ROW()),'Configuration Liste élèves'!$Q$8)+2*(COUNTIF(INDIRECT(\"G\"&ROW()):INDIRECT(\"WH\"&ROW()),'Configuration Liste élèves'!$Q$9)))))","v":""}]
[null,{"$f":"IF(A52=\"\",\"\",'Configuration Liste élèves'!B97)","v":""},{"$f":"IF(B52=\"\",\"\",'Configuration Liste élèves'!C97)","v":""},null,{"$f":"IF(B52=\"\",\"\",COUNTIF(INDIRECT(\"G\"&ROW()):INDIRECT(\"WH\"&ROW()),'Configuration Liste élèves'!$Q$5))","v":""},{"$f":"IF(B52=\"\",\"\",COUNTIF(INDIRECT(\"G\"&ROW()):INDIRECT(\"WH\"&ROW()),'Configuration Liste élèves'!$Q$2)+COUNTIF(INDIRECT(\"G\"&ROW()):INDIRECT(\"WH\"&ROW()),'Configuration Liste élèves'!$Q$3)+2*(COUNTIF(INDIRECT(\"G\"&ROW()):INDIRECT(\"WH\"&ROW()),'Configuration Liste élèves'!$Q$4+COUNTIF(INDIRECT(\"G\"&ROW()):INDIRECT(\"WH\"&ROW()),'Configuration Liste élèves'!$Q$7)+COUNTIF(INDIRECT(\"G\"&ROW()):INDIRECT(\"WH\"&ROW()),'Configuration Liste élèves'!$Q$8)+2*(COUNTIF(INDIRECT(\"G\"&ROW()):INDIRECT(\"WH\"&ROW()),'Configuration Liste élèves'!$Q$9)))))","v":""}]
[null,{"$f":"IF(A53=\"\",\"\",'Configuration Liste élèves'!B98)","v":""},{"$f":"IF(B53=\"\",\"\",'Configuration Liste élèves'!C98)","v":""},null,{"$f":"IF(B53=\"\",\"\",COUNTIF(INDIRECT(\"G\"&ROW()):INDIRECT(\"WH\"&ROW()),'Configuration Liste élèves'!$Q$5))","v":""},{"$f":"IF(B53=\"\",\"\",COUNTIF(INDIRECT(\"G\"&ROW()):INDIRECT(\"WH\"&ROW()),'Configuration Liste élèves'!$Q$2)+COUNTIF(INDIRECT(\"G\"&ROW()):INDIRECT(\"WH\"&ROW()),'Configuration Liste élèves'!$Q$3)+2*(COUNTIF(INDIRECT(\"G\"&ROW()):INDIRECT(\"WH\"&ROW()),'Configuration Liste élèves'!$Q$4+COUNTIF(INDIRECT(\"G\"&ROW()):INDIRECT(\"WH\"&ROW()),'Configuration Liste élèves'!$Q$7)+COUNTIF(INDIRECT(\"G\"&ROW()):INDIRECT(\"WH\"&ROW()),'Configuration Liste élèves'!$Q$8)+2*(COUNTIF(INDIRECT(\"G\"&ROW()):INDIRECT(\"WH\"&ROW()),'Configuration Liste élèves'!$Q$9)))))","v":""}]
[null,{"$f":"IF(A54=\"\",\"\",'Configuration Liste élèves'!B99)","v":""},{"$f":"IF(B54=\"\",\"\",'Configuration Liste élèves'!C99)","v":""},null,{"$f":"IF(B54=\"\",\"\",COUNTIF(INDIRECT(\"G\"&ROW()):INDIRECT(\"WH\"&ROW()),'Configuration Liste élèves'!$Q$5))","v":""},{"$f":"IF(B54=\"\",\"\",COUNTIF(INDIRECT(\"G\"&ROW()):INDIRECT(\"WH\"&ROW()),'Configuration Liste élèves'!$Q$2)+COUNTIF(INDIRECT(\"G\"&ROW()):INDIRECT(\"WH\"&ROW()),'Configuration Liste élèves'!$Q$3)+2*(COUNTIF(INDIRECT(\"G\"&ROW()):INDIRECT(\"WH\"&ROW()),'Configuration Liste élèves'!$Q$4+COUNTIF(INDIRECT(\"G\"&ROW()):INDIRECT(\"WH\"&ROW()),'Configuration Liste élèves'!$Q$7)+COUNTIF(INDIRECT(\"G\"&ROW()):INDIRECT(\"WH\"&ROW()),'Configuration Liste élèves'!$Q$8)+2*(COUNTIF(INDIRECT(\"G\"&ROW()):INDIRECT(\"WH\"&ROW()),'Configuration Liste élèves'!$Q$9)))))","v":""}]
[null,{"$f":"IF(A55=\"\",\"\",'Configuration Liste élèves'!B100)","v":""},{"$f":"IF(B55=\"\",\"\",'Configuration Liste élèves'!C100)","v":""},null,{"$f":"IF(B55=\"\",\"\",COUNTIF(INDIRECT(\"G\"&ROW()):INDIRECT(\"WH\"&ROW()),'Configuration Liste élèves'!$Q$5))","v":""},{"$f":"IF(B55=\"\",\"\",COUNTIF(INDIRECT(\"G\"&ROW()):INDIRECT(\"WH\"&ROW()),'Configuration Liste élèves'!$Q$2)+COUNTIF(INDIRECT(\"G\"&ROW()):INDIRECT(\"WH\"&ROW()),'Configuration Liste élèves'!$Q$3)+2*(COUNTIF(INDIRECT(\"G\"&ROW()):INDIRECT(\"WH\"&ROW()),'Configuration Liste élèves'!$Q$4+COUNTIF(INDIRECT(\"G\"&ROW()):INDIRECT(\"WH\"&ROW()),'Configuration Liste élèves'!$Q$7)+COUNTIF(INDIRECT(\"G\"&ROW()):INDIRECT(\"WH\"&ROW()),'Configuration Liste élèves'!$Q$8)+2*(COUNTIF(INDIRECT(\"G\"&ROW()):INDIRECT(\"WH\"&ROW()),'Configuration Liste élèves'!$Q$9)))))","v":""}]
[null,{"$f":"IF(A56=\"\",\"\",'Configuration Liste élèves'!B101)","v":""},{"$f":"IF(B56=\"\",\"\",'Configuration Liste élèves'!C101)","v":""},null,{"$f":"IF(B56=\"\",\"\",COUNTIF(INDIRECT(\"G\"&ROW()):INDIRECT(\"WH\"&ROW()),'Configuration Liste élèves'!$Q$5))","v":""},{"$f":"IF(B56=\"\",\"\",COUNTIF(INDIRECT(\"G\"&ROW()):INDIRECT(\"WH\"&ROW()),'Configuration Liste élèves'!$Q$2)+COUNTIF(INDIRECT(\"G\"&ROW()):INDIRECT(\"WH\"&ROW()),'Configuration Liste élèves'!$Q$3)+2*(COUNTIF(INDIRECT(\"G\"&ROW()):INDIRECT(\"WH\"&ROW()),'Configuration Liste élèves'!$Q$4+COUNTIF(INDIRECT(\"G\"&ROW()):INDIRECT(\"WH\"&ROW()),'Configuration Liste élèves'!$Q$7)+COUNTIF(INDIRECT(\"G\"&ROW()):INDIRECT(\"WH\"&ROW()),'Configuration Liste élèves'!$Q$8)+2*(COUNTIF(INDIRECT(\"G\"&ROW()):INDIRECT(\"WH\"&ROW()),'Configuration Liste élèves'!$Q$9)))))","v":""}]
[null,{"$f":"IF(A57=\"\",\"\",'Configuration Liste élèves'!B102)","v":""},{"$f":"IF(B57=\"\",\"\",'Configuration Liste élèves'!C102)","v":""},null,{"$f":"IF(B57=\"\",\"\",COUNTIF(INDIRECT(\"G\"&ROW()):INDIRECT(\"WH\"&ROW()),'Configuration Liste élèves'!$Q$5))","v":""},{"$f":"IF(B57=\"\",\"\",COUNTIF(INDIRECT(\"G\"&ROW()):INDIRECT(\"WH\"&ROW()),'Configuration Liste élèves'!$Q$2)+COUNTIF(INDIRECT(\"G\"&ROW()):INDIRECT(\"WH\"&ROW()),'Configuration Liste élèves'!$Q$3)+2*(COUNTIF(INDIRECT(\"G\"&ROW()):INDIRECT(\"WH\"&ROW()),'Configuration Liste élèves'!$Q$4+COUNTIF(INDIRECT(\"G\"&ROW()):INDIRECT(\"WH\"&ROW()),'Configuration Liste élèves'!$Q$7)+COUNTIF(INDIRECT(\"G\"&ROW()):INDIRECT(\"WH\"&ROW()),'Configuration Liste élèves'!$Q$8)+2*(COUNTIF(INDIRECT(\"G\"&ROW()):INDIRECT(\"WH\"&ROW()),'Configuration Liste élèves'!$Q$9)))))","v":""}]
[null,{"$f":"IF(A58=\"\",\"\",'Configuration Liste élèves'!B103)","v":""},{"$f":"IF(B58=\"\",\"\",'Configuration Liste élèves'!C103)","v":""},null,{"$f":"IF(B58=\"\",\"\",COUNTIF(INDIRECT(\"G\"&ROW()):INDIRECT(\"WH\"&ROW()),'Configuration Liste élèves'!$Q$5))","v":""},{"$f":"IF(B58=\"\",\"\",COUNTIF(INDIRECT(\"G\"&ROW()):INDIRECT(\"WH\"&ROW()),'Configuration Liste élèves'!$Q$2)+COUNTIF(INDIRECT(\"G\"&ROW()):INDIRECT(\"WH\"&ROW()),'Configuration Liste élèves'!$Q$3)+2*(COUNTIF(INDIRECT(\"G\"&ROW()):INDIRECT(\"WH\"&ROW()),'Configuration Liste élèves'!$Q$4+COUNTIF(INDIRECT(\"G\"&ROW()):INDIRECT(\"WH\"&ROW()),'Configuration Liste élèves'!$Q$7)+COUNTIF(INDIRECT(\"G\"&ROW()):INDIRECT(\"WH\"&ROW()),'Configuration Liste élèves'!$Q$8)+2*(COUNTIF(INDIRECT(\"G\"&ROW()):INDIRECT(\"WH\"&ROW()),'Configuration Liste élèves'!$Q$9)))))","v":""}]
[null,{"$f":"IF(A59=\"\",\"\",'Configuration Liste élèves'!B104)","v":""},{"$f":"IF(B59=\"\",\"\",'Configuration Liste élèves'!C104)","v":""},null,{"$f":"IF(B59=\"\",\"\",COUNTIF(INDIRECT(\"G\"&ROW()):INDIRECT(\"WH\"&ROW()),'Configuration Liste élèves'!$Q$5))","v":""},{"$f":"IF(B59=\"\",\"\",COUNTIF(INDIRECT(\"G\"&ROW()):INDIRECT(\"WH\"&ROW()),'Configuration Liste élèves'!$Q$2)+COUNTIF(INDIRECT(\"G\"&ROW()):INDIRECT(\"WH\"&ROW()),'Configuration Liste élèves'!$Q$3)+2*(COUNTIF(INDIRECT(\"G\"&ROW()):INDIRECT(\"WH\"&ROW()),'Configuration Liste élèves'!$Q$4+COUNTIF(INDIRECT(\"G\"&ROW()):INDIRECT(\"WH\"&ROW()),'Configuration Liste élèves'!$Q$7)+COUNTIF(INDIRECT(\"G\"&ROW()):INDIRECT(\"WH\"&ROW()),'Configuration Liste élèves'!$Q$8)+2*(COUNTIF(INDIRECT(\"G\"&ROW()):INDIRECT(\"WH\"&ROW()),'Configuration Liste élèves'!$Q$9)))))","v":""}]
[null,{"$f":"IF(A60=\"\",\"\",'Configuration Liste élèves'!B105)","v":""},{"$f":"IF(B60=\"\",\"\",'Configuration Liste élèves'!C105)","v":""},null,{"$f":"IF(B60=\"\",\"\",COUNTIF(INDIRECT(\"G\"&ROW()):INDIRECT(\"WH\"&ROW()),'Configuration Liste élèves'!$Q$5))","v":""},{"$f":"IF(B60=\"\",\"\",COUNTIF(INDIRECT(\"G\"&ROW()):INDIRECT(\"WH\"&ROW()),'Configuration Liste élèves'!$Q$2)+COUNTIF(INDIRECT(\"G\"&ROW()):INDIRECT(\"WH\"&ROW()),'Configuration Liste élèves'!$Q$3)+2*(COUNTIF(INDIRECT(\"G\"&ROW()):INDIRECT(\"WH\"&ROW()),'Configuration Liste élèves'!$Q$4+COUNTIF(INDIRECT(\"G\"&ROW()):INDIRECT(\"WH\"&ROW()),'Configuration Liste élèves'!$Q$7)+COUNTIF(INDIRECT(\"G\"&ROW()):INDIRECT(\"WH\"&ROW()),'Configuration Liste élèves'!$Q$8)+2*(COUNTIF(INDIRECT(\"G\"&ROW()):INDIRECT(\"WH\"&ROW()),'Configuration Liste élèves'!$Q$9)))))","v":""}]
[null,{"$f":"IF(A61=\"\",\"\",'Configuration Liste élèves'!B106)","v":""},{"$f":"IF(B61=\"\",\"\",'Configuration Liste élèves'!C106)","v":""},null,{"$f":"IF(B61=\"\",\"\",COUNTIF(INDIRECT(\"G\"&ROW()):INDIRECT(\"WH\"&ROW()),'Configuration Liste élèves'!$Q$5))","v":""},{"$f":"IF(B61=\"\",\"\",COUNTIF(INDIRECT(\"G\"&ROW()):INDIRECT(\"WH\"&ROW()),'Configuration Liste élèves'!$Q$2)+COUNTIF(INDIRECT(\"G\"&ROW()):INDIRECT(\"WH\"&ROW()),'Configuration Liste élèves'!$Q$3)+2*(COUNTIF(INDIRECT(\"G\"&ROW()):INDIRECT(\"WH\"&ROW()),'Configuration Liste élèves'!$Q$4+COUNTIF(INDIRECT(\"G\"&ROW()):INDIRECT(\"WH\"&ROW()),'Configuration Liste élèves'!$Q$7)+COUNTIF(INDIRECT(\"G\"&ROW()):INDIRECT(\"WH\"&ROW()),'Configuration Liste élèves'!$Q$8)+2*(COUNTIF(INDIRECT(\"G\"&ROW()):INDIRECT(\"WH\"&ROW()),'Configuration Liste élèves'!$Q$9)))))","v":""}]
[null,{"$f":"IF(A62=\"\",\"\",'Configuration Liste élèves'!B107)","v":""},{"$f":"IF(B62=\"\",\"\",'Configuration Liste élèves'!C107)","v":""},null,{"$f":"IF(B62=\"\",\"\",COUNTIF(INDIRECT(\"G\"&ROW()):INDIRECT(\"WH\"&ROW()),'Configuration Liste élèves'!$Q$5))","v":""},{"$f":"IF(B62=\"\",\"\",COUNTIF(INDIRECT(\"G\"&ROW()):INDIRECT(\"WH\"&ROW()),'Configuration Liste élèves'!$Q$2)+COUNTIF(INDIRECT(\"G\"&ROW()):INDIRECT(\"WH\"&ROW()),'Configuration Liste élèves'!$Q$3)+2*(COUNTIF(INDIRECT(\"G\"&ROW()):INDIRECT(\"WH\"&ROW()),'Configuration Liste élèves'!$Q$4+COUNTIF(INDIRECT(\"G\"&ROW()):INDIRECT(\"WH\"&ROW()),'Configuration Liste élèves'!$Q$7)+COUNTIF(INDIRECT(\"G\"&ROW()):INDIRECT(\"WH\"&ROW()),'Configuration Liste élèves'!$Q$8)+2*(COUNTIF(INDIRECT(\"G\"&ROW()):INDIRECT(\"WH\"&ROW()),'Configuration Liste élèves'!$Q$9)))))","v":""}]
[null,{"$f":"IF(A63=\"\",\"\",'Configuration Liste élèves'!B108)","v":""},{"$f":"IF(B63=\"\",\"\",'Configuration Liste élèves'!C108)","v":""},null,{"$f":"IF(B63=\"\",\"\",COUNTIF(INDIRECT(\"G\"&ROW()):INDIRECT(\"WH\"&ROW()),'Configuration Liste élèves'!$Q$5))","v":""},{"$f":"IF(B63=\"\",\"\",COUNTIF(INDIRECT(\"G\"&ROW()):INDIRECT(\"WH\"&ROW()),'Configuration Liste élèves'!$Q$2)+COUNTIF(INDIRECT(\"G\"&ROW()):INDIRECT(\"WH\"&ROW()),'Configuration Liste élèves'!$Q$3)+2*(COUNTIF(INDIRECT(\"G\"&ROW()):INDIRECT(\"WH\"&ROW()),'Configuration Liste élèves'!$Q$4+COUNTIF(INDIRECT(\"G\"&ROW()):INDIRECT(\"WH\"&ROW()),'Configuration Liste élèves'!$Q$7)+COUNTIF(INDIRECT(\"G\"&ROW()):INDIRECT(\"WH\"&ROW()),'Configuration Liste élèves'!$Q$8)+2*(COUNTIF(INDIRECT(\"G\"&ROW()):INDIRECT(\"WH\"&ROW()),'Configuration Liste élèves'!$Q$9)))))","v":""}]
[null,{"$f":"IF(A64=\"\",\"\",'Configuration Liste élèves'!B109)","v":""},{"$f":"IF(B64=\"\",\"\",'Configuration Liste élèves'!C109)","v":""},null,{"$f":"IF(B64=\"\",\"\",COUNTIF(INDIRECT(\"G\"&ROW()):INDIRECT(\"WH\"&ROW()),'Configuration Liste élèves'!$Q$5))","v":""},{"$f":"IF(B64=\"\",\"\",COUNTIF(INDIRECT(\"G\"&ROW()):INDIRECT(\"WH\"&ROW()),'Configuration Liste élèves'!$Q$2)+COUNTIF(INDIRECT(\"G\"&ROW()):INDIRECT(\"WH\"&ROW()),'Configuration Liste élèves'!$Q$3)+2*(COUNTIF(INDIRECT(\"G\"&ROW()):INDIRECT(\"WH\"&ROW()),'Configuration Liste élèves'!$Q$4+COUNTIF(INDIRECT(\"G\"&ROW()):INDIRECT(\"WH\"&ROW()),'Configuration Liste élèves'!$Q$7)+COUNTIF(INDIRECT(\"G\"&ROW()):INDIRECT(\"WH\"&ROW()),'Configuration Liste élèves'!$Q$8)+2*(COUNTIF(INDIRECT(\"G\"&ROW()):INDIRECT(\"WH\"&ROW()),'Configuration Liste élèves'!$Q$9)))))","v":""}]
[null,{"$f":"IF(A65=\"\",\"\",'Configuration Liste élèves'!B110)","v":""},{"$f":"IF(B65=\"\",\"\",'Configuration Liste élèves'!C110)","v":""},null,{"$f":"IF(B65=\"\",\"\",COUNTIF(INDIRECT(\"G\"&ROW()):INDIRECT(\"WH\"&ROW()),'Configuration Liste élèves'!$Q$5))","v":""},{"$f":"IF(B65=\"\",\"\",COUNTIF(INDIRECT(\"G\"&ROW()):INDIRECT(\"WH\"&ROW()),'Configuration Liste élèves'!$Q$2)+COUNTIF(INDIRECT(\"G\"&ROW()):INDIRECT(\"WH\"&ROW()),'Configuration Liste élèves'!$Q$3)+2*(COUNTIF(INDIRECT(\"G\"&ROW()):INDIRECT(\"WH\"&ROW()),'Configuration Liste élèves'!$Q$4+COUNTIF(INDIRECT(\"G\"&ROW()):INDIRECT(\"WH\"&ROW()),'Configuration Liste élèves'!$Q$7)+COUNTIF(INDIRECT(\"G\"&ROW()):INDIRECT(\"WH\"&ROW()),'Configuration Liste élèves'!$Q$8)+2*(COUNTIF(INDIRECT(\"G\"&ROW()):INDIRECT(\"WH\"&ROW()),'Configuration Liste élèves'!$Q$9)))))","v":""}]
[null,{"$f":"IF(A66=\"\",\"\",'Configuration Liste élèves'!B111)","v":""},{"$f":"IF(B66=\"\",\"\",'Configuration Liste élèves'!C111)","v":""},null,{"$f":"IF(B66=\"\",\"\",COUNTIF(INDIRECT(\"G\"&ROW()):INDIRECT(\"WH\"&ROW()),'Configuration Liste élèves'!$Q$5))","v":""},{"$f":"IF(B66=\"\",\"\",COUNTIF(INDIRECT(\"G\"&ROW()):INDIRECT(\"WH\"&ROW()),'Configuration Liste élèves'!$Q$2)+COUNTIF(INDIRECT(\"G\"&ROW()):INDIRECT(\"WH\"&ROW()),'Configuration Liste élèves'!$Q$3)+2*(COUNTIF(INDIRECT(\"G\"&ROW()):INDIRECT(\"WH\"&ROW()),'Configuration Liste élèves'!$Q$4+COUNTIF(INDIRECT(\"G\"&ROW()):INDIRECT(\"WH\"&ROW()),'Configuration Liste élèves'!$Q$7)+COUNTIF(INDIRECT(\"G\"&ROW()):INDIRECT(\"WH\"&ROW()),'Configuration Liste élèves'!$Q$8)+2*(COUNTIF(INDIRECT(\"G\"&ROW()):INDIRECT(\"WH\"&ROW()),'Configuration Liste élèves'!$Q$9)))))","v":""}]
[null,{"$f":"IF(A67=\"\",\"\",'Configuration Liste élèves'!B112)","v":""},{"$f":"IF(B67=\"\",\"\",'Configuration Liste élèves'!C112)","v":""},null,{"$f":"IF(B67=\"\",\"\",COUNTIF(INDIRECT(\"G\"&ROW()):INDIRECT(\"WH\"&ROW()),'Configuration Liste élèves'!$Q$5))","v":""},{"$f":"IF(B67=\"\",\"\",COUNTIF(INDIRECT(\"G\"&ROW()):INDIRECT(\"WH\"&ROW()),'Configuration Liste élèves'!$Q$2)+COUNTIF(INDIRECT(\"G\"&ROW()):INDIRECT(\"WH\"&ROW()),'Configuration Liste élèves'!$Q$3)+2*(COUNTIF(INDIRECT(\"G\"&ROW()):INDIRECT(\"WH\"&ROW()),'Configuration Liste élèves'!$Q$4+COUNTIF(INDIRECT(\"G\"&ROW()):INDIRECT(\"WH\"&ROW()),'Configuration Liste élèves'!$Q$7)+COUNTIF(INDIRECT(\"G\"&ROW()):INDIRECT(\"WH\"&ROW()),'Configuration Liste élèves'!$Q$8)+2*(COUNTIF(INDIRECT(\"G\"&ROW()):INDIRECT(\"WH\"&ROW()),'Configuration Liste élèves'!$Q$9)))))","v":""}]
[null,{"$f":"IF(A68=\"\",\"\",'Configuration Liste élèves'!B113)","v":""},{"$f":"IF(B68=\"\",\"\",'Configuration Liste élèves'!C113)","v":""},null,{"$f":"IF(B68=\"\",\"\",COUNTIF(INDIRECT(\"G\"&ROW()):INDIRECT(\"WH\"&ROW()),'Configuration Liste élèves'!$Q$5))","v":""},{"$f":"IF(B68=\"\",\"\",COUNTIF(INDIRECT(\"G\"&ROW()):INDIRECT(\"WH\"&ROW()),'Configuration Liste élèves'!$Q$2)+COUNTIF(INDIRECT(\"G\"&ROW()):INDIRECT(\"WH\"&ROW()),'Configuration Liste élèves'!$Q$3)+2*(COUNTIF(INDIRECT(\"G\"&ROW()):INDIRECT(\"WH\"&ROW()),'Configuration Liste élèves'!$Q$4+COUNTIF(INDIRECT(\"G\"&ROW()):INDIRECT(\"WH\"&ROW()),'Configuration Liste élèves'!$Q$7)+COUNTIF(INDIRECT(\"G\"&ROW()):INDIRECT(\"WH\"&ROW()),'Configuration Liste élèves'!$Q$8)+2*(COUNTIF(INDIRECT(\"G\"&ROW()):INDIRECT(\"WH\"&ROW()),'Configuration Liste élèves'!$Q$9)))))","v":""}]
[null,{"$f":"IF(A69=\"\",\"\",'Configuration Liste élèves'!B114)","v":""},{"$f":"IF(B69=\"\",\"\",'Configuration Liste élèves'!C114)","v":""},null,{"$f":"IF(B69=\"\",\"\",COUNTIF(INDIRECT(\"G\"&ROW()):INDIRECT(\"WH\"&ROW()),'Configuration Liste élèves'!$Q$5))","v":""},{"$f":"IF(B69=\"\",\"\",COUNTIF(INDIRECT(\"G\"&ROW()):INDIRECT(\"WH\"&ROW()),'Configuration Liste élèves'!$Q$2)+COUNTIF(INDIRECT(\"G\"&ROW()):INDIRECT(\"WH\"&ROW()),'Configuration Liste élèves'!$Q$3)+2*(COUNTIF(INDIRECT(\"G\"&ROW()):INDIRECT(\"WH\"&ROW()),'Configuration Liste élèves'!$Q$4+COUNTIF(INDIRECT(\"G\"&ROW()):INDIRECT(\"WH\"&ROW()),'Configuration Liste élèves'!$Q$7)+COUNTIF(INDIRECT(\"G\"&ROW()):INDIRECT(\"WH\"&ROW()),'Configuration Liste élèves'!$Q$8)+2*(COUNTIF(INDIRECT(\"G\"&ROW()):INDIRECT(\"WH\"&ROW()),'Configuration Liste élèves'!$Q$9)))))","v":""}]
[null,{"$f":"IF(A70=\"\",\"\",'Configuration Liste élèves'!B115)","v":""},{"$f":"IF(B70=\"\",\"\",'Configuration Liste élèves'!C115)","v":""},null,{"$f":"IF(B70=\"\",\"\",COUNTIF(INDIRECT(\"G\"&ROW()):INDIRECT(\"WH\"&ROW()),'Configuration Liste élèves'!$Q$5))","v":""},{"$f":"IF(B70=\"\",\"\",COUNTIF(INDIRECT(\"G\"&ROW()):INDIRECT(\"WH\"&ROW()),'Configuration Liste élèves'!$Q$2)+COUNTIF(INDIRECT(\"G\"&ROW()):INDIRECT(\"WH\"&ROW()),'Configuration Liste élèves'!$Q$3)+2*(COUNTIF(INDIRECT(\"G\"&ROW()):INDIRECT(\"WH\"&ROW()),'Configuration Liste élèves'!$Q$4+COUNTIF(INDIRECT(\"G\"&ROW()):INDIRECT(\"WH\"&ROW()),'Configuration Liste élèves'!$Q$7)+COUNTIF(INDIRECT(\"G\"&ROW()):INDIRECT(\"WH\"&ROW()),'Configuration Liste élèves'!$Q$8)+2*(COUNTIF(INDIRECT(\"G\"&ROW()):INDIRECT(\"WH\"&ROW()),'Configuration Liste élèves'!$Q$9)))))","v":""}]
[null,{"$f":"IF(A71=\"\",\"\",'Configuration Liste élèves'!B116)","v":""},{"$f":"IF(B71=\"\",\"\",'Configuration Liste élèves'!C116)","v":""},null,{"$f":"IF(B71=\"\",\"\",COUNTIF(INDIRECT(\"G\"&ROW()):INDIRECT(\"WH\"&ROW()),'Configuration Liste élèves'!$Q$5))","v":""},{"$f":"IF(B71=\"\",\"\",COUNTIF(INDIRECT(\"G\"&ROW()):INDIRECT(\"WH\"&ROW()),'Configuration Liste élèves'!$Q$2)+COUNTIF(INDIRECT(\"G\"&ROW()):INDIRECT(\"WH\"&ROW()),'Configuration Liste élèves'!$Q$3)+2*(COUNTIF(INDIRECT(\"G\"&ROW()):INDIRECT(\"WH\"&ROW()),'Configuration Liste élèves'!$Q$4+COUNTIF(INDIRECT(\"G\"&ROW()):INDIRECT(\"WH\"&ROW()),'Configuration Liste élèves'!$Q$7)+COUNTIF(INDIRECT(\"G\"&ROW()):INDIRECT(\"WH\"&ROW()),'Configuration Liste élèves'!$Q$8)+2*(COUNTIF(INDIRECT(\"G\"&ROW()):INDIRECT(\"WH\"&ROW()),'Configuration Liste élèves'!$Q$9)))))","v":""}]
[null,{"$f":"IF(A72=\"\",\"\",'Configuration Liste élèves'!B117)","v":""},{"$f":"IF(B72=\"\",\"\",'Configuration Liste élèves'!C117)","v":""},null,{"$f":"IF(B72=\"\",\"\",COUNTIF(INDIRECT(\"G\"&ROW()):INDIRECT(\"WH\"&ROW()),'Configuration Liste élèves'!$Q$5))","v":""},{"$f":"IF(B72=\"\",\"\",COUNTIF(INDIRECT(\"G\"&ROW()):INDIRECT(\"WH\"&ROW()),'Configuration Liste élèves'!$Q$2)+COUNTIF(INDIRECT(\"G\"&ROW()):INDIRECT(\"WH\"&ROW()),'Configuration Liste élèves'!$Q$3)+2*(COUNTIF(INDIRECT(\"G\"&ROW()):INDIRECT(\"WH\"&ROW()),'Configuration Liste élèves'!$Q$4+COUNTIF(INDIRECT(\"G\"&ROW()):INDIRECT(\"WH\"&ROW()),'Configuration Liste élèves'!$Q$7)+COUNTIF(INDIRECT(\"G\"&ROW()):INDIRECT(\"WH\"&ROW()),'Configuration Liste élèves'!$Q$8)+2*(COUNTIF(INDIRECT(\"G\"&ROW()):INDIRECT(\"WH\"&ROW()),'Configuration Liste élèves'!$Q$9)))))","v":""}]
[null,{"$f":"IF(A73=\"\",\"\",'Configuration Liste élèves'!B118)","v":""},{"$f":"IF(B73=\"\",\"\",'Configuration Liste élèves'!C118)","v":""},null,{"$f":"IF(B73=\"\",\"\",COUNTIF(INDIRECT(\"G\"&ROW()):INDIRECT(\"WH\"&ROW()),'Configuration Liste élèves'!$Q$5))","v":""},{"$f":"IF(B73=\"\",\"\",COUNTIF(INDIRECT(\"G\"&ROW()):INDIRECT(\"WH\"&ROW()),'Configuration Liste élèves'!$Q$2)+COUNTIF(INDIRECT(\"G\"&ROW()):INDIRECT(\"WH\"&ROW()),'Configuration Liste élèves'!$Q$3)+2*(COUNTIF(INDIRECT(\"G\"&ROW()):INDIRECT(\"WH\"&ROW()),'Configuration Liste élèves'!$Q$4+COUNTIF(INDIRECT(\"G\"&ROW()):INDIRECT(\"WH\"&ROW()),'Configuration Liste élèves'!$Q$7)+COUNTIF(INDIRECT(\"G\"&ROW()):INDIRECT(\"WH\"&ROW()),'Configuration Liste élèves'!$Q$8)+2*(COUNTIF(INDIRECT(\"G\"&ROW()):INDIRECT(\"WH\"&ROW()),'Configuration Liste élèves'!$Q$9)))))","v":""}]
[null,{"$f":"IF(A74=\"\",\"\",'Configuration Liste élèves'!B119)","v":""},{"$f":"IF(B74=\"\",\"\",'Configuration Liste élèves'!C119)","v":""},null,{"$f":"IF(B74=\"\",\"\",COUNTIF(INDIRECT(\"G\"&ROW()):INDIRECT(\"WH\"&ROW()),'Configuration Liste élèves'!$Q$5))","v":""},{"$f":"IF(B74=\"\",\"\",COUNTIF(INDIRECT(\"G\"&ROW()):INDIRECT(\"WH\"&ROW()),'Configuration Liste élèves'!$Q$2)+COUNTIF(INDIRECT(\"G\"&ROW()):INDIRECT(\"WH\"&ROW()),'Configuration Liste élèves'!$Q$3)+2*(COUNTIF(INDIRECT(\"G\"&ROW()):INDIRECT(\"WH\"&ROW()),'Configuration Liste élèves'!$Q$4+COUNTIF(INDIRECT(\"G\"&ROW()):INDIRECT(\"WH\"&ROW()),'Configuration Liste élèves'!$Q$7)+COUNTIF(INDIRECT(\"G\"&ROW()):INDIRECT(\"WH\"&ROW()),'Configuration Liste élèves'!$Q$8)+2*(COUNTIF(INDIRECT(\"G\"&ROW()):INDIRECT(\"WH\"&ROW()),'Configuration Liste élèves'!$Q$9)))))","v":""}]
[null,{"$f":"IF(A75=\"\",\"\",'Configuration Liste élèves'!B120)","v":""},{"$f":"IF(B75=\"\",\"\",'Configuration Liste élèves'!C120)","v":""},null,{"$f":"IF(B75=\"\",\"\",COUNTIF(INDIRECT(\"G\"&ROW()):INDIRECT(\"WH\"&ROW()),'Configuration Liste élèves'!$Q$5))","v":""},{"$f":"IF(B75=\"\",\"\",COUNTIF(INDIRECT(\"G\"&ROW()):INDIRECT(\"WH\"&ROW()),'Configuration Liste élèves'!$Q$2)+COUNTIF(INDIRECT(\"G\"&ROW()):INDIRECT(\"WH\"&ROW()),'Configuration Liste élèves'!$Q$3)+2*(COUNTIF(INDIRECT(\"G\"&ROW()):INDIRECT(\"WH\"&ROW()),'Configuration Liste élèves'!$Q$4+COUNTIF(INDIRECT(\"G\"&ROW()):INDIRECT(\"WH\"&ROW()),'Configuration Liste élèves'!$Q$7)+COUNTIF(INDIRECT(\"G\"&ROW()):INDIRECT(\"WH\"&ROW()),'Configuration Liste élèves'!$Q$8)+2*(COUNTIF(INDIRECT(\"G\"&ROW()):INDIRECT(\"WH\"&ROW()),'Configuration Liste élèves'!$Q$9)))))","v":""}]
[null,{"$f":"IF(A76=\"\",\"\",'Configuration Liste élèves'!B121)","v":""},{"$f":"IF(B76=\"\",\"\",'Configuration Liste élèves'!C121)","v":""},null,{"$f":"IF(B76=\"\",\"\",COUNTIF(INDIRECT(\"G\"&ROW()):INDIRECT(\"WH\"&ROW()),'Configuration Liste élèves'!$Q$5))","v":""},{"$f":"IF(B76=\"\",\"\",COUNTIF(INDIRECT(\"G\"&ROW()):INDIRECT(\"WH\"&ROW()),'Configuration Liste élèves'!$Q$2)+COUNTIF(INDIRECT(\"G\"&ROW()):INDIRECT(\"WH\"&ROW()),'Configuration Liste élèves'!$Q$3)+2*(COUNTIF(INDIRECT(\"G\"&ROW()):INDIRECT(\"WH\"&ROW()),'Configuration Liste élèves'!$Q$4+COUNTIF(INDIRECT(\"G\"&ROW()):INDIRECT(\"WH\"&ROW()),'Configuration Liste élèves'!$Q$7)+COUNTIF(INDIRECT(\"G\"&ROW()):INDIRECT(\"WH\"&ROW()),'Configuration Liste élèves'!$Q$8)+2*(COUNTIF(INDIRECT(\"G\"&ROW()):INDIRECT(\"WH\"&ROW()),'Configuration Liste élèves'!$Q$9)))))","v":""}]
[null,{"$f":"IF(A77=\"\",\"\",'Configuration Liste élèves'!B122)","v":""},{"$f":"IF(B77=\"\",\"\",'Configuration Liste élèves'!C122)","v":""},null,{"$f":"IF(B77=\"\",\"\",COUNTIF(INDIRECT(\"G\"&ROW()):INDIRECT(\"WH\"&ROW()),'Configuration Liste élèves'!$Q$5))","v":""},{"$f":"IF(B77=\"\",\"\",COUNTIF(INDIRECT(\"G\"&ROW()):INDIRECT(\"WH\"&ROW()),'Configuration Liste élèves'!$Q$2)+COUNTIF(INDIRECT(\"G\"&ROW()):INDIRECT(\"WH\"&ROW()),'Configuration Liste élèves'!$Q$3)+2*(COUNTIF(INDIRECT(\"G\"&ROW()):INDIRECT(\"WH\"&ROW()),'Configuration Liste élèves'!$Q$4+COUNTIF(INDIRECT(\"G\"&ROW()):INDIRECT(\"WH\"&ROW()),'Configuration Liste élèves'!$Q$7)+COUNTIF(INDIRECT(\"G\"&ROW()):INDIRECT(\"WH\"&ROW()),'Configuration Liste élèves'!$Q$8)+2*(COUNTIF(INDIRECT(\"G\"&ROW()):INDIRECT(\"WH\"&ROW()),'Configuration Liste élèves'!$Q$9)))))","v":""}]
[null,{"$f":"IF(A78=\"\",\"\",'Configuration Liste élèves'!B123)","v":""},{"$f":"IF(B78=\"\",\"\",'Configuration Liste élèves'!C123)","v":""},null,{"$f":"IF(B78=\"\",\"\",COUNTIF(INDIRECT(\"G\"&ROW()):INDIRECT(\"WH\"&ROW()),'Configuration Liste élèves'!$Q$5))","v":""},{"$f":"IF(B78=\"\",\"\",COUNTIF(INDIRECT(\"G\"&ROW()):INDIRECT(\"WH\"&ROW()),'Configuration Liste élèves'!$Q$2)+COUNTIF(INDIRECT(\"G\"&ROW()):INDIRECT(\"WH\"&ROW()),'Configuration Liste élèves'!$Q$3)+2*(COUNTIF(INDIRECT(\"G\"&ROW()):INDIRECT(\"WH\"&ROW()),'Configuration Liste élèves'!$Q$4+COUNTIF(INDIRECT(\"G\"&ROW()):INDIRECT(\"WH\"&ROW()),'Configuration Liste élèves'!$Q$7)+COUNTIF(INDIRECT(\"G\"&ROW()):INDIRECT(\"WH\"&ROW()),'Configuration Liste élèves'!$Q$8)+2*(COUNTIF(INDIRECT(\"G\"&ROW()):INDIRECT(\"WH\"&ROW()),'Configuration Liste élèves'!$Q$9)))))","v":""}]
[null,{"$f":"IF(A79=\"\",\"\",'Configuration Liste élèves'!B124)","v":""},{"$f":"IF(B79=\"\",\"\",'Configuration Liste élèves'!C124)","v":""},null,{"$f":"IF(B79=\"\",\"\",COUNTIF(INDIRECT(\"G\"&ROW()):INDIRECT(\"WH\"&ROW()),'Configuration Liste élèves'!$Q$5))","v":""},{"$f":"IF(B79=\"\",\"\",COUNTIF(INDIRECT(\"G\"&ROW()):INDIRECT(\"WH\"&ROW()),'Configuration Liste élèves'!$Q$2)+COUNTIF(INDIRECT(\"G\"&ROW()):INDIRECT(\"WH\"&ROW()),'Configuration Liste élèves'!$Q$3)+2*(COUNTIF(INDIRECT(\"G\"&ROW()):INDIRECT(\"WH\"&ROW()),'Configuration Liste élèves'!$Q$4+COUNTIF(INDIRECT(\"G\"&ROW()):INDIRECT(\"WH\"&ROW()),'Configuration Liste élèves'!$Q$7)+COUNTIF(INDIRECT(\"G\"&ROW()):INDIRECT(\"WH\"&ROW()),'Configuration Liste élèves'!$Q$8)+2*(COUNTIF(INDIRECT(\"G\"&ROW()):INDIRECT(\"WH\"&ROW()),'Configuration Liste élèves'!$Q$9)))))","v":""}]
[null,{"$f":"IF(A80=\"\",\"\",'Configuration Liste élèves'!B125)","v":""},{"$f":"IF(B80=\"\",\"\",'Configuration Liste élèves'!C125)","v":""},null,{"$f":"IF(B80=\"\",\"\",COUNTIF(INDIRECT(\"G\"&ROW()):INDIRECT(\"WH\"&ROW()),'Configuration Liste élèves'!$Q$5))","v":""},{"$f":"IF(B80=\"\",\"\",COUNTIF(INDIRECT(\"G\"&ROW()):INDIRECT(\"WH\"&ROW()),'Configuration Liste élèves'!$Q$2)+COUNTIF(INDIRECT(\"G\"&ROW()):INDIRECT(\"WH\"&ROW()),'Configuration Liste élèves'!$Q$3)+2*(COUNTIF(INDIRECT(\"G\"&ROW()):INDIRECT(\"WH\"&ROW()),'Configuration Liste élèves'!$Q$4+COUNTIF(INDIRECT(\"G\"&ROW()):INDIRECT(\"WH\"&ROW()),'Configuration Liste élèves'!$Q$7)+COUNTIF(INDIRECT(\"G\"&ROW()):INDIRECT(\"WH\"&ROW()),'Configuration Liste élèves'!$Q$8)+2*(COUNTIF(INDIRECT(\"G\"&ROW()):INDIRECT(\"WH\"&ROW()),'Configuration Liste élèves'!$Q$9)))))","v":""}]
[null,{"$f":"IF(A81=\"\",\"\",'Configuration Liste élèves'!B126)","v":""},{"$f":"IF(B81=\"\",\"\",'Configuration Liste élèves'!C126)","v":""},null,{"$f":"IF(B81=\"\",\"\",COUNTIF(INDIRECT(\"G\"&ROW()):INDIRECT(\"WH\"&ROW()),'Configuration Liste élèves'!$Q$5))","v":""},{"$f":"IF(B81=\"\",\"\",COUNTIF(INDIRECT(\"G\"&ROW()):INDIRECT(\"WH\"&ROW()),'Configuration Liste élèves'!$Q$2)+COUNTIF(INDIRECT(\"G\"&ROW()):INDIRECT(\"WH\"&ROW()),'Configuration Liste élèves'!$Q$3)+2*(COUNTIF(INDIRECT(\"G\"&ROW()):INDIRECT(\"WH\"&ROW()),'Configuration Liste élèves'!$Q$4+COUNTIF(INDIRECT(\"G\"&ROW()):INDIRECT(\"WH\"&ROW()),'Configuration Liste élèves'!$Q$7)+COUNTIF(INDIRECT(\"G\"&ROW()):INDIRECT(\"WH\"&ROW()),'Configuration Liste élèves'!$Q$8)+2*(COUNTIF(INDIRECT(\"G\"&ROW()):INDIRECT(\"WH\"&ROW()),'Configuration Liste élèves'!$Q$9)))))","v":""}]
[null,{"$f":"IF(A82=\"\",\"\",'Configuration Liste élèves'!B127)","v":""},{"$f":"IF(B82=\"\",\"\",'Configuration Liste élèves'!C127)","v":""},null,{"$f":"IF(B82=\"\",\"\",COUNTIF(INDIRECT(\"G\"&ROW()):INDIRECT(\"WH\"&ROW()),'Configuration Liste élèves'!$Q$5))","v":""},{"$f":"IF(B82=\"\",\"\",COUNTIF(INDIRECT(\"G\"&ROW()):INDIRECT(\"WH\"&ROW()),'Configuration Liste élèves'!$Q$2)+COUNTIF(INDIRECT(\"G\"&ROW()):INDIRECT(\"WH\"&ROW()),'Configuration Liste élèves'!$Q$3)+2*(COUNTIF(INDIRECT(\"G\"&ROW()):INDIRECT(\"WH\"&ROW()),'Configuration Liste élèves'!$Q$4+COUNTIF(INDIRECT(\"G\"&ROW()):INDIRECT(\"WH\"&ROW()),'Configuration Liste élèves'!$Q$7)+COUNTIF(INDIRECT(\"G\"&ROW()):INDIRECT(\"WH\"&ROW()),'Configuration Liste élèves'!$Q$8)+2*(COUNTIF(INDIRECT(\"G\"&ROW()):INDIRECT(\"WH\"&ROW()),'Configuration Liste élèves'!$Q$9)))))","v":""}]
[null,{"$f":"IF(A83=\"\",\"\",'Configuration Liste élèves'!B128)","v":""},{"$f":"IF(B83=\"\",\"\",'Configuration Liste élèves'!C128)","v":""},null,{"$f":"IF(B83=\"\",\"\",COUNTIF(INDIRECT(\"G\"&ROW()):INDIRECT(\"WH\"&ROW()),'Configuration Liste élèves'!$Q$5))","v":""},{"$f":"IF(B83=\"\",\"\",COUNTIF(INDIRECT(\"G\"&ROW()):INDIRECT(\"WH\"&ROW()),'Configuration Liste élèves'!$Q$2)+COUNTIF(INDIRECT(\"G\"&ROW()):INDIRECT(\"WH\"&ROW()),'Configuration Liste élèves'!$Q$3)+2*(COUNTIF(INDIRECT(\"G\"&ROW()):INDIRECT(\"WH\"&ROW()),'Configuration Liste élèves'!$Q$4+COUNTIF(INDIRECT(\"G\"&ROW()):INDIRECT(\"WH\"&ROW()),'Configuration Liste élèves'!$Q$7)+COUNTIF(INDIRECT(\"G\"&ROW()):INDIRECT(\"WH\"&ROW()),'Configuration Liste élèves'!$Q$8)+2*(COUNTIF(INDIRECT(\"G\"&ROW()):INDIRECT(\"WH\"&ROW()),'Configuration Liste élèves'!$Q$9)))))","v":""}]
[null,{"$f":"IF(A84=\"\",\"\",'Configuration Liste élèves'!B129)","v":""},{"$f":"IF(B84=\"\",\"\",'Configuration Liste élèves'!C129)","v":""},null,{"$f":"IF(B84=\"\",\"\",COUNTIF(INDIRECT(\"G\"&ROW()):INDIRECT(\"WH\"&ROW()),'Configuration Liste élèves'!$Q$5))","v":""},{"$f":"IF(B84=\"\",\"\",COUNTIF(INDIRECT(\"G\"&ROW()):INDIRECT(\"WH\"&ROW()),'Configuration Liste élèves'!$Q$2)+COUNTIF(INDIRECT(\"G\"&ROW()):INDIRECT(\"WH\"&ROW()),'Configuration Liste élèves'!$Q$3)+2*(COUNTIF(INDIRECT(\"G\"&ROW()):INDIRECT(\"WH\"&ROW()),'Configuration Liste élèves'!$Q$4+COUNTIF(INDIRECT(\"G\"&ROW()):INDIRECT(\"WH\"&ROW()),'Configuration Liste élèves'!$Q$7)+COUNTIF(INDIRECT(\"G\"&ROW()):INDIRECT(\"WH\"&ROW()),'Configuration Liste élèves'!$Q$8)+2*(COUNTIF(INDIRECT(\"G\"&ROW()):INDIRECT(\"WH\"&ROW()),'Configuration Liste élèves'!$Q$9)))))","v":""}]
[null,{"$f":"IF(A85=\"\",\"\",'Configuration Liste élèves'!B130)","v":""},{"$f":"IF(B85=\"\",\"\",'Configuration Liste élèves'!C130)","v":""},null,{"$f":"IF(B85=\"\",\"\",COUNTIF(INDIRECT(\"G\"&ROW()):INDIRECT(\"WH\"&ROW()),'Configuration Liste élèves'!$Q$5))","v":""},{"$f":"IF(B85=\"\",\"\",COUNTIF(INDIRECT(\"G\"&ROW()):INDIRECT(\"WH\"&ROW()),'Configuration Liste élèves'!$Q$2)+COUNTIF(INDIRECT(\"G\"&ROW()):INDIRECT(\"WH\"&ROW()),'Configuration Liste élèves'!$Q$3)+2*(COUNTIF(INDIRECT(\"G\"&ROW()):INDIRECT(\"WH\"&ROW()),'Configuration Liste élèves'!$Q$4+COUNTIF(INDIRECT(\"G\"&ROW()):INDIRECT(\"WH\"&ROW()),'Configuration Liste élèves'!$Q$7)+COUNTIF(INDIRECT(\"G\"&ROW()):INDIRECT(\"WH\"&ROW()),'Configuration Liste élèves'!$Q$8)+2*(COUNTIF(INDIRECT(\"G\"&ROW()):INDIRECT(\"WH\"&ROW()),'Configuration Liste élèves'!$Q$9)))))","v":""}]
[null,{"$f":"IF(A86=\"\",\"\",'Configuration Liste élèves'!B131)","v":""},{"$f":"IF(B86=\"\",\"\",'Configuration Liste élèves'!C131)","v":""},null,{"$f":"IF(B86=\"\",\"\",COUNTIF(INDIRECT(\"G\"&ROW()):INDIRECT(\"WH\"&ROW()),'Configuration Liste élèves'!$Q$5))","v":""},{"$f":"IF(B86=\"\",\"\",COUNTIF(INDIRECT(\"G\"&ROW()):INDIRECT(\"WH\"&ROW()),'Configuration Liste élèves'!$Q$2)+COUNTIF(INDIRECT(\"G\"&ROW()):INDIRECT(\"WH\"&ROW()),'Configuration Liste élèves'!$Q$3)+2*(COUNTIF(INDIRECT(\"G\"&ROW()):INDIRECT(\"WH\"&ROW()),'Configuration Liste élèves'!$Q$4+COUNTIF(INDIRECT(\"G\"&ROW()):INDIRECT(\"WH\"&ROW()),'Configuration Liste élèves'!$Q$7)+COUNTIF(INDIRECT(\"G\"&ROW()):INDIRECT(\"WH\"&ROW()),'Configuration Liste élèves'!$Q$8)+2*(COUNTIF(INDIRECT(\"G\"&ROW()):INDIRECT(\"WH\"&ROW()),'Configuration Liste élèves'!$Q$9)))))","v":""}]
[null,{"$f":"IF(A87=\"\",\"\",'Configuration Liste élèves'!B132)","v":""},{"$f":"IF(B87=\"\",\"\",'Configuration Liste élèves'!C132)","v":""},null,{"$f":"IF(B87=\"\",\"\",COUNTIF(INDIRECT(\"G\"&ROW()):INDIRECT(\"WH\"&ROW()),'Configuration Liste élèves'!$Q$5))","v":""},{"$f":"IF(B87=\"\",\"\",COUNTIF(INDIRECT(\"G\"&ROW()):INDIRECT(\"WH\"&ROW()),'Configuration Liste élèves'!$Q$2)+COUNTIF(INDIRECT(\"G\"&ROW()):INDIRECT(\"WH\"&ROW()),'Configuration Liste élèves'!$Q$3)+2*(COUNTIF(INDIRECT(\"G\"&ROW()):INDIRECT(\"WH\"&ROW()),'Configuration Liste élèves'!$Q$4+COUNTIF(INDIRECT(\"G\"&ROW()):INDIRECT(\"WH\"&ROW()),'Configuration Liste élèves'!$Q$7)+COUNTIF(INDIRECT(\"G\"&ROW()):INDIRECT(\"WH\"&ROW()),'Configuration Liste élèves'!$Q$8)+2*(COUNTIF(INDIRECT(\"G\"&ROW()):INDIRECT(\"WH\"&ROW()),'Configuration Liste élèves'!$Q$9)))))","v":""}]
[null,null,null,null,{"$f":"IF(B88=\"\",\"\",COUNTIF(INDIRECT(\"G\"&ROW()):INDIRECT(\"WH\"&ROW()),'Configuration Liste élèves'!$Q$5))","v":""},{"$f":"IF(B88=\"\",\"\",COUNTIF(INDIRECT(\"G\"&ROW()):INDIRECT(\"WH\"&ROW()),'Configuration Liste élèves'!$Q$2)+COUNTIF(INDIRECT(\"G\"&ROW()):INDIRECT(\"WH\"&ROW()),'Configuration Liste élèves'!$Q$3)+2*(COUNTIF(INDIRECT(\"G\"&ROW()):INDIRECT(\"WH\"&ROW()),'Configuration Liste élèves'!$Q$4+COUNTIF(INDIRECT(\"G\"&ROW()):INDIRECT(\"WH\"&ROW()),'Configuration Liste élèves'!$Q$7)+COUNTIF(INDIRECT(\"G\"&ROW()):INDIRECT(\"WH\"&ROW()),'Configuration Liste élèves'!$Q$8)+2*(COUNTIF(INDIRECT(\"G\"&ROW()):INDIRECT(\"WH\"&ROW()),'Configuration Liste élèves'!$Q$9)))))","v":""}]
[null,null,null,null,{"$f":"IF(B89=\"\",\"\",COUNTIF(INDIRECT(\"G\"&ROW()):INDIRECT(\"WH\"&ROW()),'Configuration Liste élèves'!$Q$5))","v":""},{"$f":"IF(B89=\"\",\"\",COUNTIF(INDIRECT(\"G\"&ROW()):INDIRECT(\"WH\"&ROW()),'Configuration Liste élèves'!$Q$2)+COUNTIF(INDIRECT(\"G\"&ROW()):INDIRECT(\"WH\"&ROW()),'Configuration Liste élèves'!$Q$3)+2*(COUNTIF(INDIRECT(\"G\"&ROW()):INDIRECT(\"WH\"&ROW()),'Configuration Liste élèves'!$Q$4+COUNTIF(INDIRECT(\"G\"&ROW()):INDIRECT(\"WH\"&ROW()),'Configuration Liste élèves'!$Q$7)+COUNTIF(INDIRECT(\"G\"&ROW()):INDIRECT(\"WH\"&ROW()),'Configuration Liste élèves'!$Q$8)+2*(COUNTIF(INDIRECT(\"G\"&ROW()):INDIRECT(\"WH\"&ROW()),'Configuration Liste élèves'!$Q$9)))))","v":""}]
[null,null,null,null,{"$f":"IF(B90=\"\",\"\",COUNTIF(INDIRECT(\"G\"&ROW()):INDIRECT(\"WH\"&ROW()),'Configuration Liste élèves'!$Q$5))","v":""},{"$f":"IF(B90=\"\",\"\",COUNTIF(INDIRECT(\"G\"&ROW()):INDIRECT(\"WH\"&ROW()),'Configuration Liste élèves'!$Q$2)+COUNTIF(INDIRECT(\"G\"&ROW()):INDIRECT(\"WH\"&ROW()),'Configuration Liste élèves'!$Q$3)+2*(COUNTIF(INDIRECT(\"G\"&ROW()):INDIRECT(\"WH\"&ROW()),'Configuration Liste élèves'!$Q$4+COUNTIF(INDIRECT(\"G\"&ROW()):INDIRECT(\"WH\"&ROW()),'Configuration Liste élèves'!$Q$7)+COUNTIF(INDIRECT(\"G\"&ROW()):INDIRECT(\"WH\"&ROW()),'Configuration Liste élèves'!$Q$8)+2*(COUNTIF(INDIRECT(\"G\"&ROW()):INDIRECT(\"WH\"&ROW()),'Configuration Liste élèves'!$Q$9)))))","v":""}]
[null,null,null,null,{"$f":"IF(B91=\"\",\"\",COUNTIF(INDIRECT(\"G\"&ROW()):INDIRECT(\"WH\"&ROW()),'Configuration Liste élèves'!$Q$5))","v":""},{"$f":"IF(B91=\"\",\"\",COUNTIF(INDIRECT(\"G\"&ROW()):INDIRECT(\"WH\"&ROW()),'Configuration Liste élèves'!$Q$2)+COUNTIF(INDIRECT(\"G\"&ROW()):INDIRECT(\"WH\"&ROW()),'Configuration Liste élèves'!$Q$3)+2*(COUNTIF(INDIRECT(\"G\"&ROW()):INDIRECT(\"WH\"&ROW()),'Configuration Liste élèves'!$Q$4+COUNTIF(INDIRECT(\"G\"&ROW()):INDIRECT(\"WH\"&ROW()),'Configuration Liste élèves'!$Q$7)+COUNTIF(INDIRECT(\"G\"&ROW()):INDIRECT(\"WH\"&ROW()),'Configuration Liste élèves'!$Q$8)+2*(COUNTIF(INDIRECT(\"G\"&ROW()):INDIRECT(\"WH\"&ROW()),'Configuration Liste élèves'!$Q$9)))))","v":""}]
[null,null,null,null,{"$f":"IF(B92=\"\",\"\",COUNTIF(INDIRECT(\"G\"&ROW()):INDIRECT(\"WH\"&ROW()),'Configuration Liste élèves'!$Q$5))","v":""},{"$f":"IF(B92=\"\",\"\",COUNTIF(INDIRECT(\"G\"&ROW()):INDIRECT(\"WH\"&ROW()),'Configuration Liste élèves'!$Q$2)+COUNTIF(INDIRECT(\"G\"&ROW()):INDIRECT(\"WH\"&ROW()),'Configuration Liste élèves'!$Q$3)+2*(COUNTIF(INDIRECT(\"G\"&ROW()):INDIRECT(\"WH\"&ROW()),'Configuration Liste élèves'!$Q$4+COUNTIF(INDIRECT(\"G\"&ROW()):INDIRECT(\"WH\"&ROW()),'Configuration Liste élèves'!$Q$7)+COUNTIF(INDIRECT(\"G\"&ROW()):INDIRECT(\"WH\"&ROW()),'Configuration Liste élèves'!$Q$8)+2*(COUNTIF(INDIRECT(\"G\"&ROW()):INDIRECT(\"WH\"&ROW()),'Configuration Liste élèves'!$Q$9)))))","v":""}]
[null,null,null,null,{"$f":"IF(B93=\"\",\"\",COUNTIF(INDIRECT(\"G\"&ROW()):INDIRECT(\"WH\"&ROW()),'Configuration Liste élèves'!$Q$5))","v":""},{"$f":"IF(B93=\"\",\"\",COUNTIF(INDIRECT(\"G\"&ROW()):INDIRECT(\"WH\"&ROW()),'Configuration Liste élèves'!$Q$2)+COUNTIF(INDIRECT(\"G\"&ROW()):INDIRECT(\"WH\"&ROW()),'Configuration Liste élèves'!$Q$3)+2*(COUNTIF(INDIRECT(\"G\"&ROW()):INDIRECT(\"WH\"&ROW()),'Configuration Liste élèves'!$Q$4+COUNTIF(INDIRECT(\"G\"&ROW()):INDIRECT(\"WH\"&ROW()),'Configuration Liste élèves'!$Q$7)+COUNTIF(INDIRECT(\"G\"&ROW()):INDIRECT(\"WH\"&ROW()),'Configuration Liste élèves'!$Q$8)+2*(COUNTIF(INDIRECT(\"G\"&ROW()):INDIRECT(\"WH\"&ROW()),'Configuration Liste élèves'!$Q$9)))))","v":""}]
[null,null,null,null,{"$f":"IF(B94=\"\",\"\",COUNTIF(INDIRECT(\"G\"&ROW()):INDIRECT(\"WH\"&ROW()),'Configuration Liste élèves'!$Q$5))","v":""},{"$f":"IF(B94=\"\",\"\",COUNTIF(INDIRECT(\"G\"&ROW()):INDIRECT(\"WH\"&ROW()),'Configuration Liste élèves'!$Q$2)+COUNTIF(INDIRECT(\"G\"&ROW()):INDIRECT(\"WH\"&ROW()),'Configuration Liste élèves'!$Q$3)+2*(COUNTIF(INDIRECT(\"G\"&ROW()):INDIRECT(\"WH\"&ROW()),'Configuration Liste élèves'!$Q$4+COUNTIF(INDIRECT(\"G\"&ROW()):INDIRECT(\"WH\"&ROW()),'Configuration Liste élèves'!$Q$7)+COUNTIF(INDIRECT(\"G\"&ROW()):INDIRECT(\"WH\"&ROW()),'Configuration Liste élèves'!$Q$8)+2*(COUNTIF(INDIRECT(\"G\"&ROW()):INDIRECT(\"WH\"&ROW()),'Configuration Liste élèves'!$Q$9)))))","v":""}]
[null,null,null,null,{"$f":"IF(B95=\"\",\"\",COUNTIF(INDIRECT(\"G\"&ROW()):INDIRECT(\"WH\"&ROW()),'Configuration Liste élèves'!$Q$5))","v":""},{"$f":"IF(B95=\"\",\"\",COUNTIF(INDIRECT(\"G\"&ROW()):INDIRECT(\"WH\"&ROW()),'Configuration Liste élèves'!$Q$2)+COUNTIF(INDIRECT(\"G\"&ROW()):INDIRECT(\"WH\"&ROW()),'Configuration Liste élèves'!$Q$3)+2*(COUNTIF(INDIRECT(\"G\"&ROW()):INDIRECT(\"WH\"&ROW()),'Configuration Liste élèves'!$Q$4+COUNTIF(INDIRECT(\"G\"&ROW()):INDIRECT(\"WH\"&ROW()),'Configuration Liste élèves'!$Q$7)+COUNTIF(INDIRECT(\"G\"&ROW()):INDIRECT(\"WH\"&ROW()),'Configuration Liste élèves'!$Q$8)+2*(COUNTIF(INDIRECT(\"G\"&ROW()):INDIRECT(\"WH\"&ROW()),'Configuration Liste élèves'!$Q$9)))))","v":""}]
[null,null,null,null,{"$f":"IF(B96=\"\",\"\",COUNTIF(INDIRECT(\"G\"&ROW()):INDIRECT(\"WH\"&ROW()),'Configuration Liste élèves'!$Q$5))","v":""},{"$f":"IF(B96=\"\",\"\",COUNTIF(INDIRECT(\"G\"&ROW()):INDIRECT(\"WH\"&ROW()),'Configuration Liste élèves'!$Q$2)+COUNTIF(INDIRECT(\"G\"&ROW()):INDIRECT(\"WH\"&ROW()),'Configuration Liste élèves'!$Q$3)+2*(COUNTIF(INDIRECT(\"G\"&ROW()):INDIRECT(\"WH\"&ROW()),'Configuration Liste élèves'!$Q$4+COUNTIF(INDIRECT(\"G\"&ROW()):INDIRECT(\"WH\"&ROW()),'Configuration Liste élèves'!$Q$7)+COUNTIF(INDIRECT(\"G\"&ROW()):INDIRECT(\"WH\"&ROW()),'Configuration Liste élèves'!$Q$8)+2*(COUNTIF(INDIRECT(\"G\"&ROW()):INDIRECT(\"WH\"&ROW()),'Configuration Liste élèves'!$Q$9)))))","v":""}]
[null,null,null,null,{"$f":"IF(B97=\"\",\"\",COUNTIF(INDIRECT(\"G\"&ROW()):INDIRECT(\"WH\"&ROW()),'Configuration Liste élèves'!$Q$5))","v":""},{"$f":"IF(B97=\"\",\"\",COUNTIF(INDIRECT(\"G\"&ROW()):INDIRECT(\"WH\"&ROW()),'Configuration Liste élèves'!$Q$2)+COUNTIF(INDIRECT(\"G\"&ROW()):INDIRECT(\"WH\"&ROW()),'Configuration Liste élèves'!$Q$3)+2*(COUNTIF(INDIRECT(\"G\"&ROW()):INDIRECT(\"WH\"&ROW()),'Configuration Liste élèves'!$Q$4+COUNTIF(INDIRECT(\"G\"&ROW()):INDIRECT(\"WH\"&ROW()),'Configuration Liste élèves'!$Q$7)+COUNTIF(INDIRECT(\"G\"&ROW()):INDIRECT(\"WH\"&ROW()),'Configuration Liste élèves'!$Q$8)+2*(COUNTIF(INDIRECT(\"G\"&ROW()):INDIRECT(\"WH\"&ROW()),'Configuration Liste élèves'!$Q$9)))))","v":""}]
[null,null,null,null,{"$f":"IF(B98=\"\",\"\",COUNTIF(INDIRECT(\"G\"&ROW()):INDIRECT(\"WH\"&ROW()),'Configuration Liste élèves'!$Q$5))","v":""},{"$f":"IF(B98=\"\",\"\",COUNTIF(INDIRECT(\"G\"&ROW()):INDIRECT(\"WH\"&ROW()),'Configuration Liste élèves'!$Q$2)+COUNTIF(INDIRECT(\"G\"&ROW()):INDIRECT(\"WH\"&ROW()),'Configuration Liste élèves'!$Q$3)+2*(COUNTIF(INDIRECT(\"G\"&ROW()):INDIRECT(\"WH\"&ROW()),'Configuration Liste élèves'!$Q$4+COUNTIF(INDIRECT(\"G\"&ROW()):INDIRECT(\"WH\"&ROW()),'Configuration Liste élèves'!$Q$7)+COUNTIF(INDIRECT(\"G\"&ROW()):INDIRECT(\"WH\"&ROW()),'Configuration Liste élèves'!$Q$8)+2*(COUNTIF(INDIRECT(\"G\"&ROW()):INDIRECT(\"WH\"&ROW()),'Configuration Liste élèves'!$Q$9)))))","v":""}]
[null,null,null,null,{"$f":"IF(B99=\"\",\"\",COUNTIF(INDIRECT(\"G\"&ROW()):INDIRECT(\"WH\"&ROW()),'Configuration Liste élèves'!$Q$5))","v":""},{"$f":"IF(B99=\"\",\"\",COUNTIF(INDIRECT(\"G\"&ROW()):INDIRECT(\"WH\"&ROW()),'Configuration Liste élèves'!$Q$2)+COUNTIF(INDIRECT(\"G\"&ROW()):INDIRECT(\"WH\"&ROW()),'Configuration Liste élèves'!$Q$3)+2*(COUNTIF(INDIRECT(\"G\"&ROW()):INDIRECT(\"WH\"&ROW()),'Configuration Liste élèves'!$Q$4+COUNTIF(INDIRECT(\"G\"&ROW()):INDIRECT(\"WH\"&ROW()),'Configuration Liste élèves'!$Q$7)+COUNTIF(INDIRECT(\"G\"&ROW()):INDIRECT(\"WH\"&ROW()),'Configuration Liste élèves'!$Q$8)+2*(COUNTIF(INDIRECT(\"G\"&ROW()):INDIRECT(\"WH\"&ROW()),'Configuration Liste élèves'!$Q$9)))))","v":""}]
[null,null,null,null,{"$f":"IF(B100=\"\",\"\",COUNTIF(INDIRECT(\"G\"&ROW()):INDIRECT(\"WH\"&ROW()),'Configuration Liste élèves'!$Q$5))","v":""},{"$f":"IF(B100=\"\",\"\",COUNTIF(INDIRECT(\"G\"&ROW()):INDIRECT(\"WH\"&ROW()),'Configuration Liste élèves'!$Q$2)+COUNTIF(INDIRECT(\"G\"&ROW()):INDIRECT(\"WH\"&ROW()),'Configuration Liste élèves'!$Q$3)+2*(COUNTIF(INDIRECT(\"G\"&ROW()):INDIRECT(\"WH\"&ROW()),'Configuration Liste élèves'!$Q$4+COUNTIF(INDIRECT(\"G\"&ROW()):INDIRECT(\"WH\"&ROW()),'Configuration Liste élèves'!$Q$7)+COUNTIF(INDIRECT(\"G\"&ROW()):INDIRECT(\"WH\"&ROW()),'Configuration Liste élèves'!$Q$8)+2*(COUNTIF(INDIRECT(\"G\"&ROW()):INDIRECT(\"WH\"&ROW()),'Configuration Liste élèves'!$Q$9)))))","v":""}]
[null,null,null,null,{"$f":"IF(B101=\"\",\"\",COUNTIF(INDIRECT(\"G\"&ROW()):INDIRECT(\"WH\"&ROW()),'Configuration Liste élèves'!$Q$5))","v":""},{"$f":"IF(B101=\"\",\"\",COUNTIF(INDIRECT(\"G\"&ROW()):INDIRECT(\"WH\"&ROW()),'Configuration Liste élèves'!$Q$2)+COUNTIF(INDIRECT(\"G\"&ROW()):INDIRECT(\"WH\"&ROW()),'Configuration Liste élèves'!$Q$3)+2*(COUNTIF(INDIRECT(\"G\"&ROW()):INDIRECT(\"WH\"&ROW()),'Configuration Liste élèves'!$Q$4+COUNTIF(INDIRECT(\"G\"&ROW()):INDIRECT(\"WH\"&ROW()),'Configuration Liste élèves'!$Q$7)+COUNTIF(INDIRECT(\"G\"&ROW()):INDIRECT(\"WH\"&ROW()),'Configuration Liste élèves'!$Q$8)+2*(COUNTIF(INDIRECT(\"G\"&ROW()):INDIRECT(\"WH\"&ROW()),'Configuration Liste élèves'!$Q$9)))))","v":""}]
[null,null,null,null,{"$f":"IF(B102=\"\",\"\",COUNTIF(INDIRECT(\"G\"&ROW()):INDIRECT(\"WH\"&ROW()),'Configuration Liste élèves'!$Q$5))","v":""},{"$f":"IF(B102=\"\",\"\",COUNTIF(INDIRECT(\"G\"&ROW()):INDIRECT(\"WH\"&ROW()),'Configuration Liste élèves'!$Q$2)+COUNTIF(INDIRECT(\"G\"&ROW()):INDIRECT(\"WH\"&ROW()),'Configuration Liste élèves'!$Q$3)+2*(COUNTIF(INDIRECT(\"G\"&ROW()):INDIRECT(\"WH\"&ROW()),'Configuration Liste élèves'!$Q$4+COUNTIF(INDIRECT(\"G\"&ROW()):INDIRECT(\"WH\"&ROW()),'Configuration Liste élèves'!$Q$7)+COUNTIF(INDIRECT(\"G\"&ROW()):INDIRECT(\"WH\"&ROW()),'Configuration Liste élèves'!$Q$8)+2*(COUNTIF(INDIRECT(\"G\"&ROW()):INDIRECT(\"WH\"&ROW()),'Configuration Liste élèves'!$Q$9)))))","v":""}]
[null,null,null,null,{"$f":"IF(B103=\"\",\"\",COUNTIF(INDIRECT(\"G\"&ROW()):INDIRECT(\"WH\"&ROW()),'Configuration Liste élèves'!$Q$5))","v":""},{"$f":"IF(B103=\"\",\"\",COUNTIF(INDIRECT(\"G\"&ROW()):INDIRECT(\"WH\"&ROW()),'Configuration Liste élèves'!$Q$2)+COUNTIF(INDIRECT(\"G\"&ROW()):INDIRECT(\"WH\"&ROW()),'Configuration Liste élèves'!$Q$3)+2*(COUNTIF(INDIRECT(\"G\"&ROW()):INDIRECT(\"WH\"&ROW()),'Configuration Liste élèves'!$Q$4+COUNTIF(INDIRECT(\"G\"&ROW()):INDIRECT(\"WH\"&ROW()),'Configuration Liste élèves'!$Q$7)+COUNTIF(INDIRECT(\"G\"&ROW()):INDIRECT(\"WH\"&ROW()),'Configuration Liste élèves'!$Q$8)+2*(COUNTIF(INDIRECT(\"G\"&ROW()):INDIRECT(\"WH\"&ROW()),'Configuration Liste élèves'!$Q$9)))))","v":""}]
[null,null,null,null,{"$f":"IF(B104=\"\",\"\",COUNTIF(INDIRECT(\"G\"&ROW()):INDIRECT(\"WH\"&ROW()),'Configuration Liste élèves'!$Q$5))","v":""},{"$f":"IF(B104=\"\",\"\",COUNTIF(INDIRECT(\"G\"&ROW()):INDIRECT(\"WH\"&ROW()),'Configuration Liste élèves'!$Q$2)+COUNTIF(INDIRECT(\"G\"&ROW()):INDIRECT(\"WH\"&ROW()),'Configuration Liste élèves'!$Q$3)+2*(COUNTIF(INDIRECT(\"G\"&ROW()):INDIRECT(\"WH\"&ROW()),'Configuration Liste élèves'!$Q$4+COUNTIF(INDIRECT(\"G\"&ROW()):INDIRECT(\"WH\"&ROW()),'Configuration Liste élèves'!$Q$7)+COUNTIF(INDIRECT(\"G\"&ROW()):INDIRECT(\"WH\"&ROW()),'Configuration Liste élèves'!$Q$8)+2*(COUNTIF(INDIRECT(\"G\"&ROW()):INDIRECT(\"WH\"&ROW()),'Configuration Liste élèves'!$Q$9)))))","v":""}]
[null,null,null,null,{"$f":"IF(B105=\"\",\"\",COUNTIF(INDIRECT(\"G\"&ROW()):INDIRECT(\"WH\"&ROW()),'Configuration Liste élèves'!$Q$5))","v":""},{"$f":"IF(B105=\"\",\"\",COUNTIF(INDIRECT(\"G\"&ROW()):INDIRECT(\"WH\"&ROW()),'Configuration Liste élèves'!$Q$2)+COUNTIF(INDIRECT(\"G\"&ROW()):INDIRECT(\"WH\"&ROW()),'Configuration Liste élèves'!$Q$3)+2*(COUNTIF(INDIRECT(\"G\"&ROW()):INDIRECT(\"WH\"&ROW()),'Configuration Liste élèves'!$Q$4+COUNTIF(INDIRECT(\"G\"&ROW()):INDIRECT(\"WH\"&ROW()),'Configuration Liste élèves'!$Q$7)+COUNTIF(INDIRECT(\"G\"&ROW()):INDIRECT(\"WH\"&ROW()),'Configuration Liste élèves'!$Q$8)+2*(COUNTIF(INDIRECT(\"G\"&ROW()):INDIRECT(\"WH\"&ROW()),'Configuration Liste élèves'!$Q$9)))))","v":""}]
[null,null,null,null,{"$f":"IF(B106=\"\",\"\",COUNTIF(INDIRECT(\"G\"&ROW()):INDIRECT(\"WH\"&ROW()),'Configuration Liste élèves'!$Q$5))","v":""},{"$f":"IF(B106=\"\",\"\",COUNTIF(INDIRECT(\"G\"&ROW()):INDIRECT(\"WH\"&ROW()),'Configuration Liste élèves'!$Q$2)+COUNTIF(INDIRECT(\"G\"&ROW()):INDIRECT(\"WH\"&ROW()),'Configuration Liste élèves'!$Q$3)+2*(COUNTIF(INDIRECT(\"G\"&ROW()):INDIRECT(\"WH\"&ROW()),'Configuration Liste élèves'!$Q$4+COUNTIF(INDIRECT(\"G\"&ROW()):INDIRECT(\"WH\"&ROW()),'Configuration Liste élèves'!$Q$7)+COUNTIF(INDIRECT(\"G\"&ROW()):INDIRECT(\"WH\"&ROW()),'Configuration Liste élèves'!$Q$8)+2*(COUNTIF(INDIRECT(\"G\"&ROW()):INDIRECT(\"WH\"&ROW()),'Configuration Liste élèves'!$Q$9)))))","v":""}]
[null,null,null,null,{"$f":"IF(B107=\"\",\"\",COUNTIF(INDIRECT(\"G\"&ROW()):INDIRECT(\"WH\"&ROW()),'Configuration Liste élèves'!$Q$5))","v":""},{"$f":"IF(B107=\"\",\"\",COUNTIF(INDIRECT(\"G\"&ROW()):INDIRECT(\"WH\"&ROW()),'Configuration Liste élèves'!$Q$2)+COUNTIF(INDIRECT(\"G\"&ROW()):INDIRECT(\"WH\"&ROW()),'Configuration Liste élèves'!$Q$3)+2*(COUNTIF(INDIRECT(\"G\"&ROW()):INDIRECT(\"WH\"&ROW()),'Configuration Liste élèves'!$Q$4+COUNTIF(INDIRECT(\"G\"&ROW()):INDIRECT(\"WH\"&ROW()),'Configuration Liste élèves'!$Q$7)+COUNTIF(INDIRECT(\"G\"&ROW()):INDIRECT(\"WH\"&ROW()),'Configuration Liste élèves'!$Q$8)+2*(COUNTIF(INDIRECT(\"G\"&ROW()):INDIRECT(\"WH\"&ROW()),'Configuration Liste élèves'!$Q$9)))))","v":""}]
[null,null,null,null,{"$f":"IF(B108=\"\",\"\",COUNTIF(INDIRECT(\"G\"&ROW()):INDIRECT(\"WH\"&ROW()),'Configuration Liste élèves'!$Q$5))","v":""},{"$f":"IF(B108=\"\",\"\",COUNTIF(INDIRECT(\"G\"&ROW()):INDIRECT(\"WH\"&ROW()),'Configuration Liste élèves'!$Q$2)+COUNTIF(INDIRECT(\"G\"&ROW()):INDIRECT(\"WH\"&ROW()),'Configuration Liste élèves'!$Q$3)+2*(COUNTIF(INDIRECT(\"G\"&ROW()):INDIRECT(\"WH\"&ROW()),'Configuration Liste élèves'!$Q$4+COUNTIF(INDIRECT(\"G\"&ROW()):INDIRECT(\"WH\"&ROW()),'Configuration Liste élèves'!$Q$7)+COUNTIF(INDIRECT(\"G\"&ROW()):INDIRECT(\"WH\"&ROW()),'Configuration Liste élèves'!$Q$8)+2*(COUNTIF(INDIRECT(\"G\"&ROW()):INDIRECT(\"WH\"&ROW()),'Configuration Liste élèves'!$Q$9)))))","v":""}]
[null,null,null,null,{"$f":"IF(B109=\"\",\"\",COUNTIF(INDIRECT(\"G\"&ROW()):INDIRECT(\"WH\"&ROW()),'Configuration Liste élèves'!$Q$5))","v":""},{"$f":"IF(B109=\"\",\"\",COUNTIF(INDIRECT(\"G\"&ROW()):INDIRECT(\"WH\"&ROW()),'Configuration Liste élèves'!$Q$2)+COUNTIF(INDIRECT(\"G\"&ROW()):INDIRECT(\"WH\"&ROW()),'Configuration Liste élèves'!$Q$3)+2*(COUNTIF(INDIRECT(\"G\"&ROW()):INDIRECT(\"WH\"&ROW()),'Configuration Liste élèves'!$Q$4+COUNTIF(INDIRECT(\"G\"&ROW()):INDIRECT(\"WH\"&ROW()),'Configuration Liste élèves'!$Q$7)+COUNTIF(INDIRECT(\"G\"&ROW()):INDIRECT(\"WH\"&ROW()),'Configuration Liste élèves'!$Q$8)+2*(COUNTIF(INDIRECT(\"G\"&ROW()):INDIRECT(\"WH\"&ROW()),'Configuration Liste élèves'!$Q$9)))))","v":""}]
[null,null,null,null,{"$f":"IF(B110=\"\",\"\",COUNTIF(INDIRECT(\"G\"&ROW()):INDIRECT(\"WH\"&ROW()),'Configuration Liste élèves'!$Q$5))","v":""},{"$f":"IF(B110=\"\",\"\",COUNTIF(INDIRECT(\"G\"&ROW()):INDIRECT(\"WH\"&ROW()),'Configuration Liste élèves'!$Q$2)+COUNTIF(INDIRECT(\"G\"&ROW()):INDIRECT(\"WH\"&ROW()),'Configuration Liste élèves'!$Q$3)+2*(COUNTIF(INDIRECT(\"G\"&ROW()):INDIRECT(\"WH\"&ROW()),'Configuration Liste élèves'!$Q$4+COUNTIF(INDIRECT(\"G\"&ROW()):INDIRECT(\"WH\"&ROW()),'Configuration Liste élèves'!$Q$7)+COUNTIF(INDIRECT(\"G\"&ROW()):INDIRECT(\"WH\"&ROW()),'Configuration Liste élèves'!$Q$8)+2*(COUNTIF(INDIRECT(\"G\"&ROW()):INDIRECT(\"WH\"&ROW()),'Configuration Liste élèves'!$Q$9)))))","v":""}]
[null,null,null,null,{"$f":"IF(B111=\"\",\"\",COUNTIF(INDIRECT(\"G\"&ROW()):INDIRECT(\"WH\"&ROW()),'Configuration Liste élèves'!$Q$5))","v":""},{"$f":"IF(B111=\"\",\"\",COUNTIF(INDIRECT(\"G\"&ROW()):INDIRECT(\"WH\"&ROW()),'Configuration Liste élèves'!$Q$2)+COUNTIF(INDIRECT(\"G\"&ROW()):INDIRECT(\"WH\"&ROW()),'Configuration Liste élèves'!$Q$3)+2*(COUNTIF(INDIRECT(\"G\"&ROW()):INDIRECT(\"WH\"&ROW()),'Configuration Liste élèves'!$Q$4+COUNTIF(INDIRECT(\"G\"&ROW()):INDIRECT(\"WH\"&ROW()),'Configuration Liste élèves'!$Q$7)+COUNTIF(INDIRECT(\"G\"&ROW()):INDIRECT(\"WH\"&ROW()),'Configuration Liste élèves'!$Q$8)+2*(COUNTIF(INDIRECT(\"G\"&ROW()):INDIRECT(\"WH\"&ROW()),'Configuration Liste élèves'!$Q$9)))))","v":""}]
[null,null,null,null,{"$f":"IF(B112=\"\",\"\",COUNTIF(INDIRECT(\"G\"&ROW()):INDIRECT(\"WH\"&ROW()),'Configuration Liste élèves'!$Q$5))","v":""},{"$f":"IF(B112=\"\",\"\",COUNTIF(INDIRECT(\"G\"&ROW()):INDIRECT(\"WH\"&ROW()),'Configuration Liste élèves'!$Q$2)+COUNTIF(INDIRECT(\"G\"&ROW()):INDIRECT(\"WH\"&ROW()),'Configuration Liste élèves'!$Q$3)+2*(COUNTIF(INDIRECT(\"G\"&ROW()):INDIRECT(\"WH\"&ROW()),'Configuration Liste élèves'!$Q$4+COUNTIF(INDIRECT(\"G\"&ROW()):INDIRECT(\"WH\"&ROW()),'Configuration Liste élèves'!$Q$7)+COUNTIF(INDIRECT(\"G\"&ROW()):INDIRECT(\"WH\"&ROW()),'Configuration Liste élèves'!$Q$8)+2*(COUNTIF(INDIRECT(\"G\"&ROW()):INDIRECT(\"WH\"&ROW()),'Configuration Liste élèves'!$Q$9)))))","v":""}]
[null,null,null,null,{"$f":"IF(B113=\"\",\"\",COUNTIF(INDIRECT(\"G\"&ROW()):INDIRECT(\"WH\"&ROW()),'Configuration Liste élèves'!$Q$5))","v":""},{"$f":"IF(B113=\"\",\"\",COUNTIF(INDIRECT(\"G\"&ROW()):INDIRECT(\"WH\"&ROW()),'Configuration Liste élèves'!$Q$2)+COUNTIF(INDIRECT(\"G\"&ROW()):INDIRECT(\"WH\"&ROW()),'Configuration Liste élèves'!$Q$3)+2*(COUNTIF(INDIRECT(\"G\"&ROW()):INDIRECT(\"WH\"&ROW()),'Configuration Liste élèves'!$Q$4+COUNTIF(INDIRECT(\"G\"&ROW()):INDIRECT(\"WH\"&ROW()),'Configuration Liste élèves'!$Q$7)+COUNTIF(INDIRECT(\"G\"&ROW()):INDIRECT(\"WH\"&ROW()),'Configuration Liste élèves'!$Q$8)+2*(COUNTIF(INDIRECT(\"G\"&ROW()):INDIRECT(\"WH\"&ROW()),'Configuration Liste élèves'!$Q$9)))))","v":""}]
[null,null,null,null,{"$f":"IF(B114=\"\",\"\",COUNTIF(INDIRECT(\"G\"&ROW()):INDIRECT(\"WH\"&ROW()),'Configuration Liste élèves'!$Q$5))","v":""},{"$f":"IF(B114=\"\",\"\",COUNTIF(INDIRECT(\"G\"&ROW()):INDIRECT(\"WH\"&ROW()),'Configuration Liste élèves'!$Q$2)+COUNTIF(INDIRECT(\"G\"&ROW()):INDIRECT(\"WH\"&ROW()),'Configuration Liste élèves'!$Q$3)+2*(COUNTIF(INDIRECT(\"G\"&ROW()):INDIRECT(\"WH\"&ROW()),'Configuration Liste élèves'!$Q$4+COUNTIF(INDIRECT(\"G\"&ROW()):INDIRECT(\"WH\"&ROW()),'Configuration Liste élèves'!$Q$7)+COUNTIF(INDIRECT(\"G\"&ROW()):INDIRECT(\"WH\"&ROW()),'Configuration Liste élèves'!$Q$8)+2*(COUNTIF(INDIRECT(\"G\"&ROW()):INDIRECT(\"WH\"&ROW()),'Configuration Liste élèves'!$Q$9)))))","v":""}]
[null,null,null,null,{"$f":"IF(B115=\"\",\"\",COUNTIF(INDIRECT(\"G\"&ROW()):INDIRECT(\"WH\"&ROW()),'Configuration Liste élèves'!$Q$5))","v":""},{"$f":"IF(B115=\"\",\"\",COUNTIF(INDIRECT(\"G\"&ROW()):INDIRECT(\"WH\"&ROW()),'Configuration Liste élèves'!$Q$2)+COUNTIF(INDIRECT(\"G\"&ROW()):INDIRECT(\"WH\"&ROW()),'Configuration Liste élèves'!$Q$3)+2*(COUNTIF(INDIRECT(\"G\"&ROW()):INDIRECT(\"WH\"&ROW()),'Configuration Liste élèves'!$Q$4+COUNTIF(INDIRECT(\"G\"&ROW()):INDIRECT(\"WH\"&ROW()),'Configuration Liste élèves'!$Q$7)+COUNTIF(INDIRECT(\"G\"&ROW()):INDIRECT(\"WH\"&ROW()),'Configuration Liste élèves'!$Q$8)+2*(COUNTIF(INDIRECT(\"G\"&ROW()):INDIRECT(\"WH\"&ROW()),'Configuration Liste élèves'!$Q$9)))))","v":""}]
[null,null,null,null,{"$f":"IF(B116=\"\",\"\",COUNTIF(INDIRECT(\"G\"&ROW()):INDIRECT(\"WH\"&ROW()),'Configuration Liste élèves'!$Q$5))","v":""},{"$f":"IF(B116=\"\",\"\",COUNTIF(INDIRECT(\"G\"&ROW()):INDIRECT(\"WH\"&ROW()),'Configuration Liste élèves'!$Q$2)+COUNTIF(INDIRECT(\"G\"&ROW()):INDIRECT(\"WH\"&ROW()),'Configuration Liste élèves'!$Q$3)+2*(COUNTIF(INDIRECT(\"G\"&ROW()):INDIRECT(\"WH\"&ROW()),'Configuration Liste élèves'!$Q$4+COUNTIF(INDIRECT(\"G\"&ROW()):INDIRECT(\"WH\"&ROW()),'Configuration Liste élèves'!$Q$7)+COUNTIF(INDIRECT(\"G\"&ROW()):INDIRECT(\"WH\"&ROW()),'Configuration Liste élèves'!$Q$8)+2*(COUNTIF(INDIRECT(\"G\"&ROW()):INDIRECT(\"WH\"&ROW()),'Configuration Liste élèves'!$Q$9)))))","v":""}]
[null,null,null,null,{"$f":"IF(B117=\"\",\"\",COUNTIF(INDIRECT(\"G\"&ROW()):INDIRECT(\"WH\"&ROW()),'Configuration Liste élèves'!$Q$5))","v":""},{"$f":"IF(B117=\"\",\"\",COUNTIF(INDIRECT(\"G\"&ROW()):INDIRECT(\"WH\"&ROW()),'Configuration Liste élèves'!$Q$2)+COUNTIF(INDIRECT(\"G\"&ROW()):INDIRECT(\"WH\"&ROW()),'Configuration Liste élèves'!$Q$3)+2*(COUNTIF(INDIRECT(\"G\"&ROW()):INDIRECT(\"WH\"&ROW()),'Configuration Liste élèves'!$Q$4+COUNTIF(INDIRECT(\"G\"&ROW()):INDIRECT(\"WH\"&ROW()),'Configuration Liste élèves'!$Q$7)+COUNTIF(INDIRECT(\"G\"&ROW()):INDIRECT(\"WH\"&ROW()),'Configuration Liste élèves'!$Q$8)+2*(COUNTIF(INDIRECT(\"G\"&ROW()):INDIRECT(\"WH\"&ROW()),'Configuration Liste élèves'!$Q$9)))))","v":""}]
[null,null,null,null,{"$f":"IF(B118=\"\",\"\",COUNTIF(INDIRECT(\"G\"&ROW()):INDIRECT(\"WH\"&ROW()),'Configuration Liste élèves'!$Q$5))","v":""},{"$f":"IF(B118=\"\",\"\",COUNTIF(INDIRECT(\"G\"&ROW()):INDIRECT(\"WH\"&ROW()),'Configuration Liste élèves'!$Q$2)+COUNTIF(INDIRECT(\"G\"&ROW()):INDIRECT(\"WH\"&ROW()),'Configuration Liste élèves'!$Q$3)+2*(COUNTIF(INDIRECT(\"G\"&ROW()):INDIRECT(\"WH\"&ROW()),'Configuration Liste élèves'!$Q$4+COUNTIF(INDIRECT(\"G\"&ROW()):INDIRECT(\"WH\"&ROW()),'Configuration Liste élèves'!$Q$7)+COUNTIF(INDIRECT(\"G\"&ROW()):INDIRECT(\"WH\"&ROW()),'Configuration Liste élèves'!$Q$8)+2*(COUNTIF(INDIRECT(\"G\"&ROW()):INDIRECT(\"WH\"&ROW()),'Configuration Liste élèves'!$Q$9)))))","v":""}]
[null,null,null,null,{"$f":"IF(B119=\"\",\"\",COUNTIF(INDIRECT(\"G\"&ROW()):INDIRECT(\"WH\"&ROW()),'Configuration Liste élèves'!$Q$5))","v":""},{"$f":"IF(B119=\"\",\"\",COUNTIF(INDIRECT(\"G\"&ROW()):INDIRECT(\"WH\"&ROW()),'Configuration Liste élèves'!$Q$2)+COUNTIF(INDIRECT(\"G\"&ROW()):INDIRECT(\"WH\"&ROW()),'Configuration Liste élèves'!$Q$3)+2*(COUNTIF(INDIRECT(\"G\"&ROW()):INDIRECT(\"WH\"&ROW()),'Configuration Liste élèves'!$Q$4+COUNTIF(INDIRECT(\"G\"&ROW()):INDIRECT(\"WH\"&ROW()),'Configuration Liste élèves'!$Q$7)+COUNTIF(INDIRECT(\"G\"&ROW()):INDIRECT(\"WH\"&ROW()),'Configuration Liste élèves'!$Q$8)+2*(COUNTIF(INDIRECT(\"G\"&ROW()):INDIRECT(\"WH\"&ROW()),'Configuration Liste élèves'!$Q$9)))))","v":""}]
[null,null,null,null,{"$f":"IF(B120=\"\",\"\",COUNTIF(INDIRECT(\"G\"&ROW()):INDIRECT(\"WH\"&ROW()),'Configuration Liste élèves'!$Q$5))","v":""},{"$f":"IF(B120=\"\",\"\",COUNTIF(INDIRECT(\"G\"&ROW()):INDIRECT(\"WH\"&ROW()),'Configuration Liste élèves'!$Q$2)+COUNTIF(INDIRECT(\"G\"&ROW()):INDIRECT(\"WH\"&ROW()),'Configuration Liste élèves'!$Q$3)+2*(COUNTIF(INDIRECT(\"G\"&ROW()):INDIRECT(\"WH\"&ROW()),'Configuration Liste élèves'!$Q$4+COUNTIF(INDIRECT(\"G\"&ROW()):INDIRECT(\"WH\"&ROW()),'Configuration Liste élèves'!$Q$7)+COUNTIF(INDIRECT(\"G\"&ROW()):INDIRECT(\"WH\"&ROW()),'Configuration Liste élèves'!$Q$8)+2*(COUNTIF(INDIRECT(\"G\"&ROW()):INDIRECT(\"WH\"&ROW()),'Configuration Liste élèves'!$Q$9)))))","v":""}]
[null,null,null,null,{"$f":"IF(B121=\"\",\"\",COUNTIF(INDIRECT(\"G\"&ROW()):INDIRECT(\"WH\"&ROW()),'Configuration Liste élèves'!$Q$5))","v":""},{"$f":"IF(B121=\"\",\"\",COUNTIF(INDIRECT(\"G\"&ROW()):INDIRECT(\"WH\"&ROW()),'Configuration Liste élèves'!$Q$2)+COUNTIF(INDIRECT(\"G\"&ROW()):INDIRECT(\"WH\"&ROW()),'Configuration Liste élèves'!$Q$3)+2*(COUNTIF(INDIRECT(\"G\"&ROW()):INDIRECT(\"WH\"&ROW()),'Configuration Liste élèves'!$Q$4+COUNTIF(INDIRECT(\"G\"&ROW()):INDIRECT(\"WH\"&ROW()),'Configuration Liste élèves'!$Q$7)+COUNTIF(INDIRECT(\"G\"&ROW()):INDIRECT(\"WH\"&ROW()),'Configuration Liste élèves'!$Q$8)+2*(COUNTIF(INDIRECT(\"G\"&ROW()):INDIRECT(\"WH\"&ROW()),'Configuration Liste élèves'!$Q$9)))))","v":""}]
[null,null,null,null,{"$f":"IF(B122=\"\",\"\",COUNTIF(INDIRECT(\"G\"&ROW()):INDIRECT(\"WH\"&ROW()),'Configuration Liste élèves'!$Q$5))","v":""},{"$f":"IF(B122=\"\",\"\",COUNTIF(INDIRECT(\"G\"&ROW()):INDIRECT(\"WH\"&ROW()),'Configuration Liste élèves'!$Q$2)+COUNTIF(INDIRECT(\"G\"&ROW()):INDIRECT(\"WH\"&ROW()),'Configuration Liste élèves'!$Q$3)+2*(COUNTIF(INDIRECT(\"G\"&ROW()):INDIRECT(\"WH\"&ROW()),'Configuration Liste élèves'!$Q$4+COUNTIF(INDIRECT(\"G\"&ROW()):INDIRECT(\"WH\"&ROW()),'Configuration Liste élèves'!$Q$7)+COUNTIF(INDIRECT(\"G\"&ROW()):INDIRECT(\"WH\"&ROW()),'Configuration Liste élèves'!$Q$8)+2*(COUNTIF(INDIRECT(\"G\"&ROW()):INDIRECT(\"WH\"&ROW()),'Configuration Liste élèves'!$Q$9)))))","v":""}]
[null,null,null,null,{"$f":"IF(B123=\"\",\"\",COUNTIF(INDIRECT(\"G\"&ROW()):INDIRECT(\"WH\"&ROW()),'Configuration Liste élèves'!$Q$5))","v":""},{"$f":"IF(B123=\"\",\"\",COUNTIF(INDIRECT(\"G\"&ROW()):INDIRECT(\"WH\"&ROW()),'Configuration Liste élèves'!$Q$2)+COUNTIF(INDIRECT(\"G\"&ROW()):INDIRECT(\"WH\"&ROW()),'Configuration Liste élèves'!$Q$3)+2*(COUNTIF(INDIRECT(\"G\"&ROW()):INDIRECT(\"WH\"&ROW()),'Configuration Liste élèves'!$Q$4+COUNTIF(INDIRECT(\"G\"&ROW()):INDIRECT(\"WH\"&ROW()),'Configuration Liste élèves'!$Q$7)+COUNTIF(INDIRECT(\"G\"&ROW()):INDIRECT(\"WH\"&ROW()),'Configuration Liste élèves'!$Q$8)+2*(COUNTIF(INDIRECT(\"G\"&ROW()):INDIRECT(\"WH\"&ROW()),'Configuration Liste élèves'!$Q$9)))))","v":""}]
[null,null,null,null,{"$f":"IF(B124=\"\",\"\",COUNTIF(INDIRECT(\"G\"&ROW()):INDIRECT(\"WH\"&ROW()),'Configuration Liste élèves'!$Q$5))","v":""},{"$f":"IF(B124=\"\",\"\",COUNTIF(INDIRECT(\"G\"&ROW()):INDIRECT(\"WH\"&ROW()),'Configuration Liste élèves'!$Q$2)+COUNTIF(INDIRECT(\"G\"&ROW()):INDIRECT(\"WH\"&ROW()),'Configuration Liste élèves'!$Q$3)+2*(COUNTIF(INDIRECT(\"G\"&ROW()):INDIRECT(\"WH\"&ROW()),'Configuration Liste élèves'!$Q$4+COUNTIF(INDIRECT(\"G\"&ROW()):INDIRECT(\"WH\"&ROW()),'Configuration Liste élèves'!$Q$7)+COUNTIF(INDIRECT(\"G\"&ROW()):INDIRECT(\"WH\"&ROW()),'Configuration Liste élèves'!$Q$8)+2*(COUNTIF(INDIRECT(\"G\"&ROW()):INDIRECT(\"WH\"&ROW()),'Configuration Liste élèves'!$Q$9)))))","v":""}]
[null,null,null,null,{"$f":"IF(B125=\"\",\"\",COUNTIF(INDIRECT(\"G\"&ROW()):INDIRECT(\"WH\"&ROW()),'Configuration Liste élèves'!$Q$5))","v":""},{"$f":"IF(B125=\"\",\"\",COUNTIF(INDIRECT(\"G\"&ROW()):INDIRECT(\"WH\"&ROW()),'Configuration Liste élèves'!$Q$2)+COUNTIF(INDIRECT(\"G\"&ROW()):INDIRECT(\"WH\"&ROW()),'Configuration Liste élèves'!$Q$3)+2*(COUNTIF(INDIRECT(\"G\"&ROW()):INDIRECT(\"WH\"&ROW()),'Configuration Liste élèves'!$Q$4+COUNTIF(INDIRECT(\"G\"&ROW()):INDIRECT(\"WH\"&ROW()),'Configuration Liste élèves'!$Q$7)+COUNTIF(INDIRECT(\"G\"&ROW()):INDIRECT(\"WH\"&ROW()),'Configuration Liste élèves'!$Q$8)+2*(COUNTIF(INDIRECT(\"G\"&ROW()):INDIRECT(\"WH\"&ROW()),'Configuration Liste élèves'!$Q$9)))))","v":""}]
[null,null,null,null,{"$f":"IF(B126=\"\",\"\",COUNTIF(INDIRECT(\"G\"&ROW()):INDIRECT(\"WH\"&ROW()),'Configuration Liste élèves'!$Q$5))","v":""},{"$f":"IF(B126=\"\",\"\",COUNTIF(INDIRECT(\"G\"&ROW()):INDIRECT(\"WH\"&ROW()),'Configuration Liste élèves'!$Q$2)+COUNTIF(INDIRECT(\"G\"&ROW()):INDIRECT(\"WH\"&ROW()),'Configuration Liste élèves'!$Q$3)+2*(COUNTIF(INDIRECT(\"G\"&ROW()):INDIRECT(\"WH\"&ROW()),'Configuration Liste élèves'!$Q$4+COUNTIF(INDIRECT(\"G\"&ROW()):INDIRECT(\"WH\"&ROW()),'Configuration Liste élèves'!$Q$7)+COUNTIF(INDIRECT(\"G\"&ROW()):INDIRECT(\"WH\"&ROW()),'Configuration Liste élèves'!$Q$8)+2*(COUNTIF(INDIRECT(\"G\"&ROW()):INDIRECT(\"WH\"&ROW()),'Configuration Liste élèves'!$Q$9)))))","v":""}]
[null,null,null,null,{"$f":"IF(B127=\"\",\"\",COUNTIF(INDIRECT(\"G\"&ROW()):INDIRECT(\"WH\"&ROW()),'Configuration Liste élèves'!$Q$5))","v":""},{"$f":"IF(B127=\"\",\"\",COUNTIF(INDIRECT(\"G\"&ROW()):INDIRECT(\"WH\"&ROW()),'Configuration Liste élèves'!$Q$2)+COUNTIF(INDIRECT(\"G\"&ROW()):INDIRECT(\"WH\"&ROW()),'Configuration Liste élèves'!$Q$3)+2*(COUNTIF(INDIRECT(\"G\"&ROW()):INDIRECT(\"WH\"&ROW()),'Configuration Liste élèves'!$Q$4+COUNTIF(INDIRECT(\"G\"&ROW()):INDIRECT(\"WH\"&ROW()),'Configuration Liste élèves'!$Q$7)+COUNTIF(INDIRECT(\"G\"&ROW()):INDIRECT(\"WH\"&ROW()),'Configuration Liste élèves'!$Q$8)+2*(COUNTIF(INDIRECT(\"G\"&ROW()):INDIRECT(\"WH\"&ROW()),'Configuration Liste élèves'!$Q$9)))))","v":""}]
[null,null,null,null,{"$f":"IF(B128=\"\",\"\",COUNTIF(INDIRECT(\"G\"&ROW()):INDIRECT(\"WH\"&ROW()),'Configuration Liste élèves'!$Q$5))","v":""},{"$f":"IF(B128=\"\",\"\",COUNTIF(INDIRECT(\"G\"&ROW()):INDIRECT(\"WH\"&ROW()),'Configuration Liste élèves'!$Q$2)+COUNTIF(INDIRECT(\"G\"&ROW()):INDIRECT(\"WH\"&ROW()),'Configuration Liste élèves'!$Q$3)+2*(COUNTIF(INDIRECT(\"G\"&ROW()):INDIRECT(\"WH\"&ROW()),'Configuration Liste élèves'!$Q$4+COUNTIF(INDIRECT(\"G\"&ROW()):INDIRECT(\"WH\"&ROW()),'Configuration Liste élèves'!$Q$7)+COUNTIF(INDIRECT(\"G\"&ROW()):INDIRECT(\"WH\"&ROW()),'Configuration Liste élèves'!$Q$8)+2*(COUNTIF(INDIRECT(\"G\"&ROW()):INDIRECT(\"WH\"&ROW()),'Configuration Liste élèves'!$Q$9)))))","v":""}]
[]
[null,"Présences","matin",null,null,null,{"$f":"COUNTIF(G$7:G$128,'Configuration Liste élèves'!$Q$6)+COUNTIF(G$7:G$128,'Configuration Liste élèves'!$Q$3)+COUNTIF(G$7:G$128,'Configuration Liste élèves'!$Q$5)+COUNTIF(G$7:G$128,'Configuration Liste élèves'!$Q$8)","v":0}]
[null,null,"Après-midi",null,null,null,{"$f":"COUNTIF(G$7:G$128,'Configuration Liste élèves'!$Q$7)+COUNTIF(G$7:G$128,'Configuration Liste élèves'!$Q$2)+COUNTIF(G$7:G$128,'Configuration Liste élèves'!$Q$6)+COUNTIF(G$7:G$128,'Configuration Liste élèves'!$Q$5)","v":0}]
[]
[null,"Absences","matin",null,null,null,{"$f":"COUNTIF(G$7:G$128,'Configuration Liste élèves'!$Q$2)+COUNTIF(G$7:G$128,'Configuration Liste élèves'!$Q$7)","v":0}]
[null,null,"Après-midi",null,null,null,{"$f":"COUNTIF(G$7:G$128,'Configuration Liste élèves'!$Q$3)+COUNTIF(G$7:G$128,'Configuration Liste élèves'!$Q$8)","v":0}]
[null,null,"toute la journée",null,null,null,{"$f":"COUNTIF(G$7:G$128,'Configuration Liste élèves'!$Q$4)+COUNTIF(G$7:G$128,'Configuration Liste élèves'!$Q$9)","v":0}]
[null,null,"total",null,null,null,{"$f":"G133+G134+(2*G135)","v":0}]
[]
[]
[null,"Statistiques Absences"]
[]
[null,"Septembre","Effectifs",null,25]
[null,null,"Nombres de demi-journée",null,22]
[null,null,"Présences possibles",null,{"$f":"E141*(2*E142)","v":1100}]
[null,null,"Absences",null,{"$f":"SUMPRODUCT((MONTH(INDIRECT(\"G6:WH6\"))=9)*(INDIRECT(\"G136:WH136\")))","v":0}]
[null,null,"% absences",null,{"$f":"IF(E151=0,\"\",(E144/E151))","v":0}]
[null,null,"% présence",null,{"$f":"IF(E145=\"\",\"\",1-E145)","v":1}]
[]
[]
[null,"Octobre","Effectifs",null,25]
[null,null,"Nombres de demi-journée",null,22]
[null,null,"Présences possibles",null,{"$f":"E149*(2*E150)","v":1100}]
[null,null,"Absences",null,{"$f":"SUMPRODUCT((MONTH(INDIRECT(\"G6:WH6\"))=10)*(INDIRECT(\"G136:WH136\")))","v":0}]
[null,null,"% absences",null,{"$f":"IF(E151=0,\"\",(E152/E151))","v":0}]
[null,null,"% présence",null,{"$f":"IF(E153=\"\",\"\",1-E153)","v":1}]
[]
[]
[null,"Novembre","Effectifs",null,25]
[null,null,"Nombres de demi-journée",null,22]
[null,null,"Présences possibles",null,{"$f":"E157*(2*E158)","v":1100}]
[null,null,"Absences",null,{"$f":"SUMPRODUCT((MONTH(INDIRECT(\"G6:WH6\"))=11)*(INDIRECT(\"G136:WH136\")))","v":0}]
[null,null,"% absences",null,{"$f":"IF(E159=0,\"\",(E160/E159))","v":0}]
[null,null,"% présence",null,{"$f":"IF(E161=\"\",\"\",1-E161)","v":1}]
[]
[]
[null,"Décembre","Effectifs",null,25]
[null,null,"Nombres de demi-journée",null,22]
[null,null,"Présences possibles",null,{"$f":"E165*(2*E166)","v":1100}]
[null,null,"Absences",null,{"$f":"SUMPRODUCT((MONTH(INDIRECT(\"G6:WH6\"))=12)*(INDIRECT(\"G136:WH136\")))","v":0}]
[null,null,"% absences",null,{"$f":"IF(E167=0,\"\",(E168/E167))","v":0}]
[null,null,"% présence",null,{"$f":"IF(E169=\"\",\"\",1-E169)","v":1}]
[]
[]
[null,"Janvier","Effectifs",null,25]
[null,null,"Nombres de demi-journée",null,22]
[null,null,"Présences possibles",null,{"$f":"E173*(2*E174)","v":1100}]
[null,null,"Absences",null,{"$f":"SUMPRODUCT((MONTH(INDIRECT(\"G6:WH6\"))=1)*(INDIRECT(\"G136:WH136\")))","v":0}]
[null,null,"% absences",null,{"$f":"IF(E175=0,\"\",(E176/E175))","v":0}]
[null,null,"% présence",null,{"$f":"IF(E177=\"\",\"\",1-E177)","v":1}]
[]
[]
[null,"Février","Effectifs",null,25]
[null,null,"Nombres de demi-journée",null,22]
[null,null,"Présences possibles",null,{"$f":"E181*(2*E182)","v":1100}]
[null,null,"Absences",null,{"$f":"SUMPRODUCT((MONTH(INDIRECT(\"G6:WH6\"))=2)*(INDIRECT(\"G136:WH136\")))","v":0}]
[null,null,"% absences",null,{"$f":"IF(E183=0,\"\",(E184/E183))","v":0}]
[null,null,"% présence",null,{"$f":"IF(E185=\"\",\"\",1-E185)","v":1}]
[]
[]
[null,"Mars","Effectifs",null,25]
[null,null,"Nombres de demi-journée",null,22]
[null,null,"Présences possibles",null,{"$f":"E189*(2*E190)","v":1100}]
[null,null,"Absences",null,{"$f":"SUMPRODUCT((MONTH(INDIRECT(\"G6:WH6\"))=3)*(INDIRECT(\"G136:WH136\")))","v":0}]
[null,null,"% absences",null,{"$f":"IF(E191=0,\"\",(E192/E191))","v":0}]
[null,null,"% présence",null,{"$f":"IF(E193=\"\",\"\",1-E193)","v":1}]
[]
[]
[null,"Avril","Effectifs",null,25]
[null,null,"Nombres de demi-journée",null,22]
[null,null,"Présences possibles",null,{"$f":"E197*(2*E198)","v":1100}]
[null,null,"Absences",null,{"$f":"SUMPRODUCT((MONTH(INDIRECT(\"G6:WH6\"))=4)*(INDIRECT(\"G136:WH136\")))","v":0}]
[null,null,"% absences",null,{"$f":"IF(E199=0,\"\",(E200/E199))","v":0}]
[null,null,"% présence",null,{"$f":"IF(E201=\"\",\"\",1-E201)","v":1}]
[]
[]
[null,"Mai","Effectifs",null,25]
[null,null,"Nombres de demi-journée",null,22]
[null,null,"Présences possibles",null,{"$f":"E205*(2*E206)","v":1100}]
[null,null,"Absences",null,{"$f":"SUMPRODUCT((MONTH(INDIRECT(\"G6:WH6\"))=5)*(INDIRECT(\"G136:WH136\")))","v":0}]
[null,null,"% absences",null,{"$f":"IF(E207=0,\"\",(E208/E207))","v":0}]
[null,null,"% présence",null,{"$f":"IF(E209=\"\",\"\",1-E209)","v":1}]
[]
[]
[null,"Juin","Effectifs",null,25]
[null,null,"Nombres de demi-journée",null,22]
[null,null,"Présences possibles",null,{"$f":"E213*(2*E214)","v":1100}]
[null,null,"Absences",null,{"$f":"SUMPRODUCT((MONTH(INDIRECT(\"G6:WH6\"))=6)*(INDIRECT(\"G136:WH136\")))","v":0}]
[null,null,"% absences",null,{"$f":"IF(E215=0,\"\",(E216/E215))","v":0}]
[null,null,"% présence",null,{"$f":"IF(E217=\"\",\"\",1-E217)","v":1}]
[]
[]
[null,"Juillet","Effectifs",null,25]
[null,null,"Nombres de demi-journée",null,22]
[null,null,"Présences possibles",null,{"$f":"E221*(2*E222)","v":1100}]
[null,null,"Absences",null,{"$f":"SUMPRODUCT((MONTH(INDIRECT(\"G6:WH6\"))=7)*(INDIRECT(\"G136:WH136\")))","v":0}]
[null,null,"% absences",null,{"$f":"IF(E223=0,\"\",(E224/E223))","v":0}]
[null,null,"% présence",null,{"$f":"IF(E225=\"\",\"\",1-E225)","v":1}]

{"sheet":"Liste CE1","index":4,"n_rows":48,"n_cols":18,"rows_kept":48,"cut":false,"hidden":false,"merged":[[0,1,0,13]]}
[null,"Liste élèves"]
["École:",null,{"$f":"Configuration!B12","v":"votre école"}]
["Enseignant:",null,{"$f":"Configuration!B14","v":"Mr DUPONT"}]
["Année scolaire:",null,{"$f":"Configuration!B10","v":"2017-2018"}]
["Classe de:",null,{"$f":"Configuration!B13","v":"niveau"}]
[null,null,null," "," "," "," "," "," "," ",null," "," "," "," "," "," "," "]
["N°","Nom","Prénom","Niv"]
[{"$f":"IF(B8=\"\",\"\",0+1)","v":1},"Boby","Fares","CE2"]
[{"$f":"IF(B9=\"\",\"\",A8+1)","v":2},"ddjytku","tykutyi","CE1"]
[{"$f":"IF(B10=\"\",\"\",A9+1)","v":3},"dfhhs","yriutèi","CE1"]
[{"$f":"IF(B11=\"\",\"\",A10+1)","v":4},"dgfhf","gdfee","CE1"]
[{"$f":"IF(B12=\"\",\"\",A11+1)","v":5},"djky","gfre","CE1"]
[{"$f":"IF(B13=\"\",\"\",A12+1)","v":6},"djtdyjt","efg","CE2"]
[{"$f":"IF(B14=\"\",\"\",A13+1)","v":7},"dttjlyyl","fgjkyt","CE1"]
[{"$f":"IF(B15=\"\",\"\",A14+1)","v":8},"dykitlu","drty","CE1"]
[{"$f":"IF(B16=\"\",\"\",A15+1)","v":9},"ehterhu","ghrt","CE2"]
[{"$f":"IF(B17=\"\",\"\",A16+1)","v":10},"eyrehj","dfguy","CE1"]
[{"$f":"IF(B18=\"\",\"\",A17+1)","v":11},"fras","jjkyf","CE2"]
[{"$f":"IF(B19=\"\",\"\",A18+1)","v":12},"fzef","dgfhjf","CE1"]
[{"$f":"IF(B20=\"\",\"\",A19+1)","v":13},"Gabin","Yanis","CE1"]
[{"$f":"IF(B21=\"\",\"\",A20+1)","v":14},"gstdeh","dfr","CE1"]
[{"$f":"IF(B22=\"\",\"\",A21+1)","v":15},"Jean","Mathieux","CE2"]
[{"$f":"IF(B23=\"\",\"\",A22+1)","v":16},"jgjrt","tuyyul","CE1"]
[{"$f":"IF(B24=\"\",\"\",A23+1)","v":17},"jjiiik","ghjgkg","CE1"]
[{"$f":"IF(B25=\"\",\"\",A24+1)","v":18},"Joyan","Sam","CE1"]
[{"$f":"IF(B26=\"\",\"\",A25+1)","v":19},"marin","Yanis","CE1"]
[{"$f":"IF(B27=\"\",\"\",A26+1)","v":20},"qerhe","ghreyuj","CE1"]
[{"$f":"IF(B28=\"\",\"\",A27+1)","v":21},"qgeh","rthhd","CE1"]
[{"$f":"IF(B29=\"\",\"\",A28+1)","v":22},"qzqg","yuihgf","CE2"]
[{"$f":"IF(B30=\"\",\"\",A29+1)","v":23},"rjytk","eryu","CE2"]
[{"$f":"IF(B31=\"\",\"\",A30+1)","v":24},"rtjsrtj","trhbnd","CE1"]
[{"$f":"IF(B32=\"\",\"\",A31+1)","v":25},"Ruth","Solène","CE1"]
[{"$f":"IF(B33=\"\",\"\",A32+1)","v":26},"sophie","farid","CE2"]
[{"$f":"IF(B34=\"\",\"\",A33+1)","v":27},"Soyan","Sophie","CE2"]
[{"$f":"IF(B35=\"\",\"\",A34+1)","v":28},"str","rfgh","CE1"]
[{"$f":"IF(B36=\"\",\"\",A35+1)","v":29},"tdyk","hge","CE1"]
[{"$f":"IF(B37=\"\",\"\",A36+1)","v":30},"tjhg","tyjngh","CE2"]
[{"$f":"IF(B38=\"\",\"\",A37+1)","v":31},"tkippm","ylyyrft","CE1"]
[{"$f":"IF(B39=\"\",\"\",A38+1)","v":32},"tkuyttd","tkkyt","CE1"]
[{"$f":"IF(B40=\"\",\"\",A39+1)","v":33},"tkyiutlk","tjtrr","CE1"]
[{"$f":"IF(B41=\"\",\"\",A40+1)","v":34},"ttty","rtuh","CE2"]
[{"$f":"IF(B42=\"\",\"\",A41+1)","v":35},"tukyly","rtrtgg","CE2"]
[{"$f":"IF(B43=\"\",\"\",A42+1)","v":36},"tykumi","tyulyu","CE2"]
[{"$f":"IF(B44=\"\",\"\",A43+1)","v":37},"tylkdtt","hfv","CE1"]
[{"$f":"IF(B45=\"\",\"\",A44+1)","v":38},"ydikyl;","gfhjkty","CE1"]
[{"$f":"IF(B46=\"\",\"\",A45+1)","v":39},"ydjdkt","jjtyer","CE2"]
[{"$f":"IF(B47=\"\",\"\",A46+1)","v":40},"ytjktrh","ytlylu","CE2"]
[{"$f":"IF(B48=\"\",\"\",A47+1)","v":41},"ytjuykilm;","yuyly","CE1"]

{"sheet":"Lundi","index":5,"n_rows":161,"n_cols":12,"rows_kept":161,"cut":false,"hidden":false,"merged":[[0,0,0,1],[1,2,1,3],[1,4,1,6],[1,11,1,13],[2,4,2,7],[2,11,6,14],[3,1,3,2],[5,0,5,1],[5,2,6,2],[5,3,6,3],[5,4,6,4],[5,5,6,5],[5,6,6,6],[5,7,6,7],[5,8,6,8],[5,9,6,9]]}
[{"$f":"Configuration!A7&Configuration!B7&Configuration!C7","v":"2017-2018"}]
["Classe : ",{"$f":"Configuration!$B$13","v":"niveau"},"Enseignant :",null,{"$f":"Configuration!B14","v":"Mr DUPONT"},null,null,null,"Jour de la semaine :","lundi",null,"Evènement d’aujourd’hui :"]
[null,null,null,null,"PLANNING JOURNALIER",null,null,null,null,null,null,{"$f":"IF('Planning annuel'!S22=0,\"\",'Planning annuel'!S22)","v":{"$error":"#N/A"}}]
["Date :","2017-06-05"]
[]
["Horaire",null,"Durée","Matière","Nature de la séance","Objectifs","Compétences","Déroulement","Matériel à préparer","Devoirs"]
["Début","fin"]
["8:45","9:00",{"$f":"IF(AND($A8=\"\",$B8=\"\"),\"\",$B8-$A8)","v":"00:15:00"},"rituel lecture","entraînement","comprendre mieux des textes et entraîner à la comprehénsion des lectures","Lire de manière fluide et comprendre la lecture","fiche de gamme de lecture","+"]
["9:00","9:45","00:45:00","Fr conjugaison","Apprentissage\nentraînement","Etudier le passé composé","Conjuguer des verbes au passé composé.\nIdentifier des verbes au passé composé.","1) découverte: conjuguer le verbe dans la phrase suivante: L'été dernier, pendant mes vacances, je (visiter) le Portugal. ==> les élèves proposent sur ardoise une conjugaison du verbe.\nObservation de la conjugaison.\n2) réinvestissement de la notion faire de même mais élève seul avec la phrase j'(adorer) Lisbonne.\n3) Structuration: leçon C9\n4) A l'oral ou sur ardoise relever les verbes à la forme du passé composé au tableau\nexo 2, 3, 4 p 72 sur cahier","tableau + exo p 72 français explicite."]
["9:50","10:15","00:25:00","Récréation"]
["10:15","11:30","01:15:00","Maths Calculs","Entraînement","Poser et calculer une division à deux chiffres au diviseur","Maîtriser la TO de la division","Calcul mental : tables de multiplication à trous\n1) retour sur ardoise d'une division et correction de à la maison\n2) poser et calculer des divisions à deux chiffres au diviseur puis en compléter\n3) correction retour sur les exercices des élèves au tableau.","affiche résolution de problème sur les masses","revoir MES 5 notamment pour calculer des masses"]
["11:30","13:45","02:15:00","Pause repas"]
["13:45","14:00","00:15:00","Devoirs",null,null,null,"Apprendre C9 et revoir Opé 8 + poser et calculer 2356 : 16 et 7845 : 25\nrevoir poésie. 9"]
["14:00","15:00","01:00:00","EMC","Apprentissage","Se servir de l'actualité, comment on élit notre président ?","comprendre le focntionnement et le rôle du chef de l'état français.","Au regard de l'actualité, on demande aux élèves ce qu'est pour eux le rôle du président de la république et comment il est élu ?\n2) distribution des documents sur le président de la République et compléter les documents avec les élèves\n3) Bilan trace écrite sur une feuille de classeur:\nLe président de la République est élu au suffrage universel direct (élu directement par le peuple). Son mandat dure cinq ans (quinquennat). Il siège au Palais de l’Elysée (Paris). Avec le Gouvernement (les ministres), l’Assemblée Nationale (les députés) et le Sénat , il s’occupe des affaires du pays. Il est également le chef de l’armée.","fiche président de la République + étape d'un vote + rétroprojecteur pour compléter la fiche sur les présidents"]
["15:00","15:45",{"$f":"IF(AND($A15=\"\",$B15=\"\"),\"\",$B15-$A15)","v":"00:45:00"},"Sciences","evaluation","Exposer le focntionnement de son objet technique","Présenter à la classe son travail\nexpliquer le focntionnement technique et l'élaboration d'un objet construit.","Les groupes d'élèves passent pour être évaluer sur les exposés qu'ils ont préparés sur les objets techniques.","fiche évaluation élève + poster exposé et objet technique"]
["15:45","16:00",{"$f":"IF(AND($A16=\"\",$B16=\"\"),\"\",$B16-$A16)","v":"00:15:00"},"Récitation","entraînement","réciter sa poésie","Réciter un texte appris par cœur","réciter son poème sur le printemps"]
[null,null,""]
[null,null,""]
[null,null,""]
[null,null,""]
[null,null,""]
[null,null,""]
[null,null,""]
[null,null,""]
[null,null,""]
[null,null,""]
[null,null,""]
[null,null,""]
[null,null,""]
[null,null,""]
[null,null,""]
[null,null,""]
[null,null,""]
[null,null,""]
[null,null,""]
[null,null,""]
[null,null,""]
[null,null,""]
[null,null,""]
[null,null,{"$f":"IF(AND($A40=\"\",$B40=\"\"),\"\",$B40-$A40)","v":""}]
[null,null,""]
[null,null,""]
[null,null,""]
[null,null,""]
[null,null,""]
[null,null,""]
[null,null,""]
[null,null,""]
[null,null,""]
[null,null,""]
[null,null,""]
[null,null,""]
[null,null,""]
[null,null,""]
[null,null,""]
[null,null,""]
[null,null,""]
[null,null,""]
[null,null,""]
[null,null,""]
[null,null,""]
[null,null,""]
[null,null,""]
[null,null,""]
[null,null,""]
[null,null,""]
[null,null,""]
[null,null,""]
[null,null,""]
[null,null,""]
[null,null,""]
[null,null,{"$f":"IF(AND($A72=\"\",$B72=\"\"),\"\",$B72-$A72)","v":""}]
[null,null,""]
[null,null,""]
[null,null,""]
[null,null,""]
[null,null,""]
[null,null,""]
[null,null,""]
[null,null,""]
[null,null,""]
[null,null,""]
[null,null,""]
[null,null,""]
[null,null,""]
[null,null,""]
[null,null,""]
[null,null,""]
[null,null,""]
[null,null,""]
[null,null,""]
[null,null,""]
[null,null,""]
[null,null,""]
[null,null,""]
[null,null,""]
[null,null,""]
[null,null,""]
[null,null,""]
[null,null,""]
[null,null,""]
[null,null,""]
[null,null,""]
[null,null,{"$f":"IF(AND($A104=\"\",$B104=\"\"),\"\",$B104-$A104)","v":""}]
[null,null,""]
[null,null,""]
[null,null,""]
[null,null,""]
[null,null,""]
[null,null,""]
[null,null,""]
[null,null,""]
[null,null,""]
[null,null,""]
[null,null,""]
[null,null,""]
[null,null,""]
[null,null,""]
[null,null,""]
[null,null,""]
[null,null,""]
[null,null,""]
[null,null,""]
[null,null,""]
[null,null,""]
[null,null,""]
[null,null,""]
[null,null,""]
[null,null,""]
[null,null,""]
[null,null,""]
[null,null,""]
[null,null,""]
[null,null,""]
[null,null,""]
[null,null,{"$f":"IF(AND($A136=\"\",$B136=\"\"),\"\",$B136-$A136)","v":""}]
[null,null,""]
[null,null,""]
[null,null,""]
[null,null,""]
[null,null,""]
[null,null,""]
[null,null,""]
[null,null,""]
[null,null,""]
[null,null,""]
[null,null,""]
[null,null,""]
[null,null,""]
[null,null,""]
[null,null,""]
[null,null,""]
[null,null,""]
[null,null,""]
[null,null,""]
[null,null,""]
[null,null,""]
[null,null,""]
[null,null,""]
[null,null,""]
[null,null,""]

{"sheet":"Mardi","index":6,"n_rows":161,"n_cols":12,"rows_kept":161,"cut":false,"hidden":false,"merged":[[0,0,0,1],[1,2,1,3],[1,4,1,6],[1,11,1,13],[2,4,2,7],[2,11,6,14],[3,1,3,2],[5,0,5,1],[5,2,6,2],[5,3,6,3],[5,4,6,4],[5,5,6,5],[5,6,6,6],[5,7,6,7],[5,8,6,8],[5,9,6,9]]}
[{"$f":"Configuration!$B$10","v":"2017-2018"}]
["Classe : ",{"$f":"Configuration!$B$13","v":"niveau"},"Enseignant :",null,{"$f":"Configuration!$B$14","v":"Mr DUPONT"},null,null,null,"Jour de la semaine :","Mardi",null,"Evènement d’aujourd’hui :"]
[null,null,null,null,"PLANNING JOURNALIER",null,null,null,null,null,null,{"$f":"IF('Planning annuel'!S23=0,\"\",'Planning annuel'!S23)","v":{"$error":"#N/A"}}]
["Date :",{"$f":"Lundi!$B$4+1","v":"2017-06-06"}]
[]
["Horaire",null,"Durée","Matière","Nature de la séance","Objectifs","Compétences","Déroulement","Matériel à préparer","Devoirs"]
["Début","Fin"]
["8:45","9:50",{"$f":"IF(AND($A8=\"\",$B8=\"\"),\"\",$B8-$A8)","v":"01:05:00"},"Equip éduc Adam C.",null,null,null,"Les élèves sont en classe d'acceuil avec un travail en mathématiques."]
["9:50","10:15","00:25:00","Récréation"]
["10:20","11:30","01:10:00","Littérature","Texte documentaire","Lire un texte documentaire","Lire et rendre compte d'une lecture","1) les élèves lisent le texte en silence.\n2) lecture magistrale et orale des élèves.\n3) Répondre aux questions par 2. puis correction.\nColler le texte du castor."]
["11:30","13:45","02:15:00","Pause repas"]
["13:45","15:00","01:15:00","Art musical","entraînement","Préparer le spectacle de l'école","Restituer un rythme appris","Les deux CM1 se rendent au gymnase et répètent le spectacle de l'école.","matériel de percussion"]
["15:00","16:00","01:00:00","Littérature","les oiseaux de la bases de Cergy","Acquérir des connaissances sur les oiseaux","Lire et comprendre un texte.\n","1) par groupe 2 à 3, les élèves vont devoir répondre à des questions dont les réponses sont dans le texte.\n2) Correction et explications.\n3) Coller les dernières pages du documents dans le cahier de bord de la classe de découverte.\n","fiche oiseaux, cahier de bord."]
[null,null,""]
[null,null,""]
[null,null,""]
[null,null,""]
[null,null,""]
[null,null,""]
[null,null,""]
[null,null,""]
[null,null,""]
[null,null,""]
[null,null,""]
[null,null,""]
[null,null,""]
[null,null,""]
[null,null,""]
[null,null,""]
[null,null,""]
[null,null,""]
[null,null,""]
[null,null,""]
[null,null,""]
[null,null,""]
[null,null,""]
[null,null,""]
[null,null,""]
[null,null,""]
[null,null,{"$f":"IF(AND($A40=\"\",$B40=\"\"),\"\",$B40-$A40)","v":""}]
[null,null,""]
[null,null,""]
[null,null,""]
[null,null,""]
[null,null,""]
[null,null,""]
[null,null,""]
[null,null,""]
[null,null,""]
[null,null,""]
[null,null,""]
[null,null,""]
[null,null,""]
[null,null,""]
[null,null,""]
[null,null,""]
[null,null,""]
[null,null,""]
[null,null,""]
[null,null,""]
[null,null,""]
[null,null,""]
[null,null,""]
[null,null,""]
[null,null,""]
[null,null,""]
[null,null,""]
[null,null,""]
[null,null,""]
[null,null,""]
[null,null,""]
[null,null,{"$f":"IF(AND($A72=\"\",$B72=\"\"),\"\",$B72-$A72)","v":""}]
[null,null,""]
[null,null,""]
[null,null,""]
[null,null,""]
[null,null,""]
[null,null,""]
[null,null,""]
[null,null,""]
[null,null,""]
[null,null,""]
[null,null,""]
[null,null,""]
[null,null,""]
[null,null,""]
[null,null,""]
[null,null,""]
[null,null,""]
[null,null,""]
[null,null,""]
[null,null,""]
[null,null,""]
[null,null,""]
[null,null,""]
[null,null,""]
[null,null,""]
[null,null,""]
[null,null,""]
[null,null,""]
[null,null,""]
[null,null,""]
[null,null,""]
[null,null,{"$f":"IF(AND($A104=\"\",$B104=\"\"),\"\",$B104-$A104)","v":""}]
[null,null,""]
[null,null,""]
[null,null,""]
[null,null,""]
[null,null,""]
[null,null,""]
[null,null,""]
[null,null,""]
[null,null,""]
[null,null,""]
[null,null,""]
[null,null,""]
[null,null,""]
[null,null,""]
[null,null,""]
[null,null,""]
[null,null,""]
[null,null,""]
[null,null,""]
[null,null,""]
[null,null,""]
[null,null,""]
[null,null,""]
[null,null,""]
[null,null,""]
[null,null,""]
[null,null,""]
[null,null,""]
[null,null,""]
[null,null,""]
[null,null,""]
[null,null,{"$f":"IF(AND($A136=\"\",$B136=\"\"),\"\",$B136-$A136)","v":""}]
[null,null,""]
[null,null,""]
[null,null,""]
[null,null,""]
[null,null,""]
[null,null,""]
[null,null,""]
[null,null,""]
[null,null,""]
[null,null,""]
[null,null,""]
[null,null,""]
[null,null,""]
[null,null,""]
[null,null,""]
[null,null,""]
[null,null,""]
[null,null,""]
[null,null,""]
[null,null,""]
[null,null,""]
[null,null,""]
[null,null,""]
[null,null,""]
[null,null,""]

{"sheet":"Mercredi","index":7,"n_rows":161,"n_cols":12,"rows_kept":161,"cut":false,"hidden":false,"merged":[[0,0,0,1],[1,2,1,3],[1,4,1,6],[1,11,1,13],[2,4,2,7],[2,11,6,14],[3,1,3,2],[5,0,5,1],[5,2,6,2],[5,3,6,3],[5,4,6,4],[5,5,6,5],[5,6,6,6],[5,7,6,7],[5,8,6,8],[5,9,6,9]]}
[{"$f":"Configuration!$B$10","v":"2017-2018"}]
["Classe : ",{"$f":"Configuration!$B$13","v":"niveau"},"Enseignant :",null,{"$f":"Configuration!$B$14","v":"Mr DUPONT"},null,null,null,"Jour de la semaine :","Mercredi",null,"Evènement d’aujourd’hui :"]
[null,null,null,null,"PLANNING JOURNALIER",null,null,null,null,null,null,{"$f":"IF('Planning annuel'!S24=0,\"\",'Planning annuel'!S24)","v":{"$error":"#N/A"}}]
["Date :",{"$f":"Lundi!B4+2","v":"2017-06-07"}]
[]
["Horaire",null,"Durée","Matière","Nature de la séance","Objectifs","Compétences","Déroulement","Matériel à préparer","Devoirs"]
["Début","Fin"]
["8:30","9:15",{"$f":"IF(AND($A8=\"\",$B8=\"\"),\"\",$B8-$A8)","v":"00:45:00"}]
["9:00","9:50","00:50:00","Maths calcul","La division à deux chiffres au diviseur","Poser et calculer une division à deux chiffres au diviseur","Diviser par un nombre à 2 chiffres","1) avec les élèves ont résoud un problème faisant intervenir la division, on détaille et les élèves font l'opération en même temps que l'enseignant (péda explicite) sur ardoise.\n2) Même problème à résoudre mais avec une donné numérique différente (1365) sur cahier du jour.\n3) Distribution de la leçon.","page 78 de maths explicite apprenons ensemble.\nLeçon de calcul Opé 8"]
["10:00","10:15","00:15:00","Récréation"]
["10:15","10:45","00:30:00","Dictée","Apprentissage entraînement","Evaluer les élèves sur la dictée préparée","écrire un texte dictée dans une synthaxe et une orthographe correctes.","Les élèves sous la dictée de l'enseignant copient un texte. Dictée 447","texte dictée"]
["10:45","11:30","00:45:00","Arts visuels","Les hexagones","Travailler sur un polygones, l'hexagone.\nIntroduire les notions sur le cercles","Suivre un programme de construction.\nTracer un cercle.\n","1) Les élèves vont découvrir les fiches. 2 niveaux.\n2) Les élèves réalisent les figure sur feuille blanche en suivant les instructions.","fiche hexagone "]
[null,null,""]
[null,null,""]
[null,null,""]
[null,null,""]
[null,null,""]
[null,null,""]
[null,null,""]
[null,null,""]
[null,null,""]
[null,null,""]
[null,null,""]
[null,null,""]
[null,null,""]
[null,null,""]
[null,null,""]
[null,null,""]
[null,null,""]
[null,null,""]
[null,null,""]
[null,null,""]
[null,null,""]
[null,null,""]
[null,null,""]
[null,null,""]
[null,null,""]
[null,null,""]
[null,null,""]
[null,null,{"$f":"IF(AND($A40=\"\",$B40=\"\"),\"\",$B40-$A40)","v":""}]
[null,null,""]
[null,null,""]
[null,null,""]
[null,null,""]
[null,null,""]
[null,null,""]
[null,null,""]
[null,null,""]
[null,null,""]
[null,null,""]
[null,null,""]
[null,null,""]
[null,null,""]
[null,null,""]
[null,null,""]
[null,null,""]
[null,null,""]
[null,null,""]
[null,null,""]
[null,null,""]
[null,null,""]
[null,null,""]
[null,null,""]
[null,null,""]
[null,null,""]
[null,null,""]
[null,null,""]
[null,null,""]
[null,null,""]
[null,null,""]
[null,null,""]
[null,null,{"$f":"IF(AND($A72=\"\",$B72=\"\"),\"\",$B72-$A72)","v":""}]
[null,null,""]
[null,null,""]
[null,null,""]
[null,null,""]
[null,null,""]
[null,null,""]
[null,null,""]
[null,null,""]
[null,null,""]
[null,null,""]
[null,null,""]
[null,null,""]
[null,null,""]
[null,null,""]
[null,null,""]
[null,null,""]
[null,null,""]
[null,null,""]
[null,null,""]
[null,null,""]
[null,null,""]
[null,null,""]
[null,null,""]
[null,null,""]
[null,null,""]
[null,null,""]
[null,null,""]
[null,null,""]
[null,null,""]
[null,null,""]
[null,null,""]
[null,null,{"$f":"IF(AND($A104=\"\",$B104=\"\"),\"\",$B104-$A104)","v":""}]
[null,null,""]
[null,null,""]
[null,null,""]
[null,null,""]
[null,null,""]
[null,null,""]
[null,null,""]
[null,null,""]
[null,null,""]
[null,null,""]
[null,null,""]
[null,null,""]
[null,null,""]
[null,null,""]
[null,null,""]
[null,null,""]
[null,null,""]
[null,null,""]
[null,null,""]
[null,null,""]
[null,null,""]
[null,null,""]
[null,null,""]
[null,null,""]
[null,null,""]
[null,null,""]
[null,null,""]
[null,null,""]
[null,null,""]
[null,null,""]
[null,null,""]
[null,null,{"$f":"IF(AND($A136=\"\",$B136=\"\"),\"\",$B136-$A136)","v":""}]
[null,null,""]
[null,null,""]
[null,null,""]
[null,null,""]
[null,null,""]
[null,null,""]
[null,null,""]
[null,null,""]
[null,null,""]
[null,null,""]
[null,null,""]
[null,null,""]
[null,null,""]
[null,null,""]
[null,null,""]
[null,null,""]
[null,null,""]
[null,null,""]
[null,null,""]
[null,null,""]
[null,null,""]
[null,null,""]
[null,null,""]
[null,null,""]
[null,null,""]

{"sheet":"Jeudi","index":8,"n_rows":160,"n_cols":12,"rows_kept":160,"cut":false,"hidden":false,"merged":[[0,0,0,1],[1,2,1,3],[1,4,1,6],[1,11,1,13],[2,4,2,7],[2,11,6,14],[3,1,3,2],[5,0,5,1],[5,2,6,2],[5,3,6,3],[5,4,6,4],[5,5,6,5],[5,6,6,6],[5,7,6,7],[5,8,6,8],[5,9,6,9]]}
[{"$f":"Configuration!$B$10","v":"2017-2018"}]
["Classe : ",{"$f":"Configuration!$B$13","v":"niveau"},"Enseignant :",null,{"$f":"Configuration!$B$14","v":"Mr DUPONT"},null,null,null,"Jour de la semaine :","Jeudi",null,"Evènement d’aujourd’hui :"]
[null,null,null,null,"PLANNING JOURNALIER",null,null,null,null,null,null,{"$f":"IF('Planning annuel'!S25=0,\"\",'Planning annuel'!S25)","v":{"$error":"#N/A"}}]
["Date :",{"$f":"Lundi!$B$4+3","v":"2017-06-08"}]
[]
["Horaire",null,"Durée","Matière","Nature de la séance","Objectifs","Compétences","Déroulement","Matériel à préparer","Devoirs"]
["Début","Fin"]
["8:45","9:00",{"$f":"IF(AND($A8=\"\",$B8=\"\"),\"\",$B8-$A8)","v":"00:15:00"},"Rituel Lecture","entraînement","Gamme de français","Divers ompétences","Divers exercices simple sur le cahier du jour","Fiche gamme de lecture"]
["9:00","9:50","00:50:00","Maths Calcul","Entraînement","réinvestir ses connaissances sur les mesures de masses","Résoudre des problèmes faisant intervenir des mesures de masses","Les élèves effectuent la fiche de problème. Alterner temps de réflexion et correction d'un problème.\nLaisser 5 à 10 min par problème.","fiche problèmes"]
["9:50","10:15","00:25:00","Récréation"]
["10:15","11:30","01:15:00","Histoire",null,null,null,"Séance faite par Mme ROUSSELIN ( La Renaissance)"]
["11:30","13:45","02:15:00","Pause repas"]
["13:45","14:00","00:15:00","Devoirs",null,null,null,"Relire le résumé de l'histoire\nCopier la poésie du printemps"]
["14:00","14:55","00:55:00","Fr littérature","apprentissage","Shémas narratif d'un polar","Lire et rendre compte de sa lecture.\nProduire un résumé","Etape 1: Retour sur les résumés de l'histoire\nEtape 2: compléter le shéma narratif d'un polar","fiche résumé histoire"]
["14:55","16:00","01:05:00","Géographie","Apprentissage","Etudier le département","Connaître le découpage administratif de la France.","Etape 1: fiches sur la région\nEtape 2: trace écrite département et région","fiche région"]
[null,null,""]
[null,null,""]
[null,null,""]
[null,null,""]
[null,null,""]
[null,null,""]
[null,null,""]
[null,null,""]
[null,null,""]
[null,null,""]
[null,null,""]
[null,null,""]
[null,null,""]
[null,null,""]
[null,null,""]
[null,null,""]
[null,null,""]
[null,null,""]
[null,null,""]
[null,null,""]
[null,null,""]
[null,null,""]
[null,null,""]
[null,null,""]
[null,null,{"$f":"IF(AND($A40=\"\",$B40=\"\"),\"\",$B40-$A40)","v":""}]
[null,null,""]
[null,null,""]
[null,null,""]
[null,null,""]
[null,null,""]
[null,null,""]
[null,null,""]
[null,null,""]
[null,null,""]
[null,null,""]
[null,null,""]
[null,null,""]
[null,null,""]
[null,null,""]
[null,null,""]
[null,null,""]
[null,null,""]
[null,null,""]
[null,null,""]
[null,null,""]
[null,null,""]
[null,null,""]
[null,null,""]
[null,null,""]
[null,null,""]
[null,null,""]
[null,null,""]
[null,null,""]
[null,null,""]
[null,null,""]
[null,null,""]
[null,null,{"$f":"IF(AND($A72=\"\",$B72=\"\"),\"\",$B72-$A72)","v":""}]
[null,null,""]
[null,null,""]
[null,null,""]
[null,null,""]
[null,null,""]
[null,null,""]
[null,null,""]
[null,null,""]
[null,null,""]
[null,null,""]
[null,null,""]
[null,null,""]
[null,null,""]
[null,null,""]
[null,null,""]
[null,null,""]
[null,null,""]
[null,null,""]
[null,null,""]
[null,null,""]
[null,null,""]
[null,null,""]
[null,null,""]
[null,null,""]
[null,null,""]
[null,null,""]
[null,null,""]
[null,null,""]
[null,null,""]
[null,null,""]
[null,null,""]
[null,null,{"$f":"IF(AND($A104=\"\",$B104=\"\"),\"\",$B104-$A104)","v":""}]
[null,null,""]
[null,null,""]
[null,null,""]
[null,null,""]
[null,null,""]
[null,null,""]
[null,null,""]
[null,null,""]
[null,null,""]
[null,null,""]
[null,null,""]
[null,null,""]
[null,null,""]
[null,null,""]
[null,null,""]
[null,null,""]
[null,null,""]
[null,null,""]
[null,null,""]
[null,null,""]
[null,null,""]
[null,null,""]
[null,null,""]
[null,null,""]
[null,null,""]
[null,null,""]
[null,null,""]
[null,null,""]
[null,null,""]
[null,null,""]
[null,null,""]
[null,null,{"$f":"IF(AND($A136=\"\",$B136=\"\"),\"\",$B136-$A136)","v":""}]
[null,null,""]
[null,null,""]
[null,null,""]
[null,null,""]
[null,null,""]
[null,null,""]
[null,null,""]
[null,null,""]
[null,null,""]
[null,null,""]
[null,null,""]
[null,null,""]
[null,null,""]
[null,null,""]
[null,null,""]
[null,null,""]
[null,null,""]
[null,null,""]
[null,null,""]
[null,null,""]
[null,null,""]
[null,null,""]
[null,null,""]
[null,null,""]

{"sheet":"Vendredi","index":9,"n_rows":160,"n_cols":12,"rows_kept":160,"cut":false,"hidden":false,"merged":[[0,0,0,1],[1,2,1,3],[1,4,1,6],[1,11,1,13],[2,4,2,7],[2,11,6,14],[3,1,3,2],[5,0,5,1],[5,2,6,2],[5,3,6,3],[5,4,6,4],[5,5,6,5],[5,6,6,6],[5,7,6,7],[5,8,6,8],[5,9,6,9]]}
[{"$f":"Configuration!$B$10","v":"2017-2018"}]
["Classe : ",{"$f":"Configuration!$B$13","v":"niveau"},"Enseignant :",null,{"$f":"Configuration!$B$14","v":"Mr DUPONT"},null,null,null,"Jour de la semaine :","Vendredi",null,"Evènement d’aujourd’hui :"]
[null,null,null,null,"PLANNING JOURNALIER",null,null,null,null,null,null,{"$f":"IF('Planning annuel'!S26=0,\"\",'Planning annuel'!S26)","v":{"$error":"#N/A"}}]
["Date :",{"$f":"Lundi!$B$4+4","v":"2017-06-09"}]
[]
["Horaire",null,"Durée","Matière","Nature de la séance","Objectifs","Compétences","Déroulement","Matériel à préparer","Devoirs"]
["Début","Fin"]
["8:45","9:00",{"$f":"IF(AND($A8=\"\",$B8=\"\"),\"\",$B8-$A8)","v":"00:15:00"},"Calcul mental","Apprentissage","Manipuler les tables de multipication ","Connaître ses tables de multiplication et les solliciter pour la division","Les élèves effectuent une série de multiplications à trous.","sur ardoise ou cahier de recherche."]
["9:00","9:50","00:50:00","Grammaire","apprentissage","S'erxercer sur la notion de GN","Repérer les GN , les modifier et les enrichir","Réalisation par les élèves d'une série d'exercices sur la manipulation des GN.","exercices sur les GN"]
["9:50","10:15",{"$f":"IF(AND($A10=\"\",$B10=\"\"),\"\",$B10-$A10)","v":"00:25:00"},"Récréation"]
["10:15","11:30","01:15:00","Anglais","Entraînement, langage oral","Réutiliser les structures languagières et le vocabulaire \nEtudier la famille royale britannique","Have you got + voc famille + civilisation famille royale","Par rotation de 20 min\nUne partie de la classe joue au jeu des 7 familles en réutilisant la structure Have you got + voc famille.\nL'autre effectue une fiche sur la famille en anglais.","jeu 7 familles + fiche sur la famille royale d'Angleterre"]
["11:30","13:45","02:15:00","Pause repas"]
["13:45","14:00",{"$f":"IF(AND($A13=\"\",$B13=\"\"),\"\",$B13-$A13)","v":"00:15:00"},"Devoirs",null,null,null,"Relire et résumer le chapitre 7.\nrevoir Mes 5\nRevoir G5"]
["14:00","15:00","01:00:00","Sciences","Apprentissage","Fabrication d'un objet technique","Fabriquer et tester un objet tetchnique","Les différents groupes fabriquent les objets techniques et préparent les exposés","fiche montage "]
["15:00 ","15:15","00:15:00","Récréation"]
["15:15","16:00","00:45:00","Maths GdM","Révision ","Réutilisation du tableau de conversion","Effectuer des conversion de masse ","Sur cahier exercices de conversion des mesures de masses."]
[null,null,""]
[null,null,""]
[null,null,""]
[null,null,""]
[null,null,""]
[null,null,""]
[null,null,""]
[null,null,""]
[null,null,""]
[null,null,""]
[null,null,""]
[null,null,""]
[null,null,""]
[null,null,""]
[null,null,""]
[null,null,""]
[null,null,""]
[null,null,""]
[null,null,""]
[null,null,""]
[null,null,""]
[null,null,""]
[null,null,""]
[null,null,{"$f":"IF(AND($A40=\"\",$B40=\"\"),\"\",$B40-$A40)","v":""}]
[null,null,""]
[null,null,""]
[null,null,""]
[null,null,""]
[null,null,""]
[null,null,""]
[null,null,""]
[null,null,""]
[null,null,""]
[null,null,""]
[null,null,""]
[null,null,""]
[null,null,""]
[null,null,""]
[null,null,""]
[null,null,""]
[null,null,""]
[null,null,""]
[null,null,""]
[null,null,""]
[null,null,""]
[null,null,""]
[null,null,""]
[null,null,""]
[null,null,""]
[null,null,""]
[null,null,""]
[null,null,""]
[null,null,""]
[null,null,""]
[null,null,""]
[null,null,{"$f":"IF(AND($A72=\"\",$B72=\"\"),\"\",$B72-$A72)","v":""}]
[null,null,""]
[null,null,""]
[null,null,""]
[null,null,""]
[null,null,""]
[null,null,""]
[null,null,""]
[null,null,""]
[null,null,""]
[null,null,""]
[null,null,""]
[null,null,""]
[null,null,""]
[null,null,""]
[null,null,""]
[null,null,""]
[null,null,""]
[null,null,""]
[null,null,""]
[null,null,""]
[null,null,""]
[null,null,""]
[null,null,""]
[null,null,""]
[null,null,""]
[null,null,""]
[null,null,""]
[null,null,""]
[null,null,""]
[null,null,""]
[null,null,""]
[null,null,{"$f":"IF(AND($A104=\"\",$B104=\"\"),\"\",$B104-$A104)","v":""}]
[null,null,""]
[null,null,""]
[null,null,""]
[null,null,""]
[null,null,""]
[null,null,""]
[null,null,""]
[null,null,""]
[null,null,""]
[null,null,""]
[null,null,""]
[null,null,""]
[null,null,""]
[null,null,""]
[null,null,""]
[null,null,""]
[null,null,""]
[null,null,""]
[null,null,""]
[null,null,""]
[null,null,""]
[null,null,""]
[null,null,""]
[null,null,""]
[null,null,""]
[null,null,""]
[null,null,""]
[null,null,""]
[null,null,""]
[null,null,""]
[null,null,""]
[null,null,{"$f":"IF(AND($A136=\"\",$B136=\"\"),\"\",$B136-$A136)","v":""}]
[null,null,""]
[null,null,""]
[null,null,""]
[null,null,""]
[null,null,""]
[null,null,""]
[null,null,""]
[null,null,""]
[null,null,""]
[null,null,""]
[null,null,""]
[null,null,""]
[null,null,""]
[null,null,""]
[null,null,""]
[null,null,""]
[null,null,""]
[null,null,""]
[null,null,""]
[null,null,""]
[null,null,""]
[null,null,""]
[null,null,""]
[null,null,""]

{"sheet":"Semainier","index":10,"n_rows":274,"n_cols":5,"rows_kept":274,"cut":false,"hidden":true,"merged":[[0,0,0,4]]}
["Semainier "]
[]
[{"$f":"Lundi!$B$4","v":"2017-06-05"},{"$f":"Lundi!$B$4+1","v":"2017-06-06"},{"$f":"Lundi!$B$4+2","v":"2017-06-07"},{"$f":"Lundi!$B$4+3","v":"2017-06-08"},{"$f":"Lundi!$B$4+4","v":"2017-06-09"}]
["LUNDI","MARDI","MERCREDI","JEUDI","VENDREDI"]
[{"$f":"IF(AND(Lundi!$D8=\"\",Lundi!$G8=\"\"),\"\",IF(Lundi!$D8=\"Récréation\",CONCATENATE(Lundi!$A8&\" / \"&Lundi!$B8)&CHAR(10)&\"RECREATION\",CONCATENATE(Lundi!$A8&\" / \"&Lundi!$B8)&CHAR(10)&\"Matière : \"&Lundi!$D8&CHAR(10)&\"Compétences : \"&Lundi!$G8))","v":"8:45 / 9:00\nMatière : rituel lecture\nCompétences : Lire de manière fluide et comprendre la lecture"},{"$f":"IF(AND(Mardi!$D8=\"\",Mardi!$G8=\"\"),\"\",IF(Mardi!$D8=\"Récréation\",CONCATENATE(Mardi!$A8&\" / \"&Mardi!$B8)&CHAR(10)&\"RECREATION\",CONCATENATE(Mardi!$A8&\" / \"&Mardi!$B8)&CHAR(10)&\"Matière : \"&Mardi!$D8&CHAR(10)&\"Compétences : \"&Mardi!$G8))","v":"8:45 / 9:50\nMatière : Equip éduc Adam C.\nCompétences : "},{"$f":"IF(AND(Mercredi!$D8=\"\",Mercredi!$G8=\"\"),\"\",IF(Mercredi!$D8=\"Récréation\",CONCATENATE(Mercredi!$A8&\" / \"&Mercredi!$B8)&CHAR(10)&\"RECREATION\",CONCATENATE(Mercredi!$A8&\" / \"&Mercredi!$B8)&CHAR(10)&\"Matière : \"&Mercredi!$D8&CHAR(10)&\"Compétences : \"&Mercredi!$G8))","v":""},{"$f":"IF(AND(Jeudi!$D8=\"\",Jeudi!$G8=\"\"),\"\",IF(Jeudi!$D8=\"Récréation\",CONCATENATE(Jeudi!$A8&\" / \"&Jeudi!$B8)&CHAR(10)&\"RECREATION\",CONCATENATE(Jeudi!$A8&\" / \"&Jeudi!$B8)&CHAR(10)&\"Matière : \"&Jeudi!$D8&CHAR(10)&\"Compétences : \"&Jeudi!$G8))","v":"8:45 / 9:00\nMatière : Rituel Lecture\nCompétences : Divers ompétences"},{"$f":"IF(AND(Vendredi!$D8=\"\",Vendredi!$G8=\"\"),\"\",IF(Vendredi!$D8=\"Récréation\",CONCATENATE(Vendredi!$A8&\" / \"&Vendredi!$B8)&CHAR(10)&\"RECREATION\",CONCATENATE(Vendredi!$A8&\" / \"&Vendredi!$B8)&CHAR(10)&\"Matière : \"&Vendredi!$D8&CHAR(10)&\"Compétences : \"&Vendredi!$G8))","v":"8:45 / 9:00\nMatière : Calcul mental\nCompétences : Connaître ses tables de multiplication et les solliciter pour la division"}]
[{"$f":"IF(AND(Lundi!$D9=\"\",Lundi!$G9=\"\"),\"\",IF(Lundi!$D9=\"Récréation\",CONCATENATE(Lundi!A9&\" / \"&Lundi!B9)&CHAR(10)&\"RECREATION\",CONCATENATE(Lundi!A9&\" / \"&Lundi!B9)&CHAR(10)&\"Matière : \"&Lundi!$D9&CHAR(10)&\"Compétences : \"&Lundi!$G9))","v":"9:00 / 9:45\nMatière : Fr conjugaison\nCompétences : Conjuguer des verbes au passé composé.\nIdentifier des verbes au passé composé."},{"$f":"IF(AND(Mardi!$D9=\"\",Mardi!$G9=\"\"),\"\",IF(Mardi!$D9=\"Récréation\",CONCATENATE(Mardi!$A9&\" / \"&Mardi!$B9)&CHAR(10)&\"RECREATION\",CONCATENATE(Mardi!$A9&\" / \"&Mardi!$B9)&CHAR(10)&\"Matière : \"&Mardi!$D9&CHAR(10)&\"Compétences : \"&Mardi!$G9))","v":"9:50 / 10:15\nRECREATION"},{"$f":"IF(AND(Mercredi!$D9=\"\",Mercredi!$G9=\"\"),\"\",IF(Mercredi!$D9=\"Récréation\",CONCATENATE(Mercredi!$A9&\" / \"&Mercredi!$B9)&CHAR(10)&\"RECREATION\",CONCATENATE(Mercredi!$A9&\" / \"&Mercredi!$B9)&CHAR(10)&\"Matière : \"&Mercredi!$D9&CHAR(10)&\"Compétences : \"&Mercredi!$G9))","v":"9:00 / 9:50\nMatière : Maths calcul\nCompétences : Diviser par un nombre à 2 chiffres"},{"$f":"IF(AND(Jeudi!#REF!=\"\",Jeudi!#REF!=\"\"),\"\",IF(Jeudi!#REF!=\"Récréation\",CONCATENATE(Jeudi!$A9&\" / \"&Jeudi!$B9)&CHAR(10)&\"RECREATION\",CONCATENATE(Jeudi!$A9&\" / \"&Jeudi!$B9)&CHAR(10)&\"Matière : \"&Jeudi!#REF!&CHAR(10)&\"Compétences : \"&Jeudi!#REF!))","v":{"$error":"#REF!"}},{"$f":"IF(AND(Vendredi!$D9=\"\",Vendredi!$G9=\"\"),\"\",IF(Vendredi!$D9=\"Récréation\",CONCATENATE(Vendredi!$A9&\" / \"&Vendredi!$B9)&CHAR(10)&\"RECREATION\",CONCATENATE(Vendredi!$A9&\" / \"&Vendredi!$B9)&CHAR(10)&\"Matière : \"&Vendredi!$D9&CHAR(10)&\"Compétences : \"&Vendredi!$G9))","v":"9:00 / 9:50\nMatière : Grammaire\nCompétences : Repérer les GN , les modifier et les enrichir"}]
[{"$f":"IF(AND(Lundi!$D10=\"\",Lundi!$G10=\"\"),\"\",IF(Lundi!$D10=\"Récréation\",CONCATENATE(Lundi!A10&\" / \"&Lundi!B10)&CHAR(10)&\"RECREATION\",CONCATENATE(Lundi!A10&\" / \"&Lundi!B10)&CHAR(10)&\"Matière : \"&Lundi!$D10&CHAR(10)&\"Compétences : \"&Lundi!$G10))","v":"9:50 / 10:15\nRECREATION"},{"$f":"IF(AND(Mardi!$D10=\"\",Mardi!$G10=\"\"),\"\",IF(Mardi!$D10=\"Récréation\",CONCATENATE(Mardi!$A10&\" / \"&Mardi!$B10)&CHAR(10)&\"RECREATION\",CONCATENATE(Mardi!$A10&\" / \"&Mardi!$B10)&CHAR(10)&\"Matière : \"&Mardi!$D10&CHAR(10)&\"Compétences : \"&Mardi!$G10))","v":"10:20 / 11:30\nMatière : Littérature\nCompétences : Lire et rendre compte d'une lecture"},{"$f":"IF(AND(Mercredi!$D10=\"\",Mercredi!$G10=\"\"),\"\",IF(Mercredi!$D10=\"Récréation\",CONCATENATE(Mercredi!$A10&\" / \"&Mercredi!$B10)&CHAR(10)&\"RECREATION\",CONCATENATE(Mercredi!$A10&\" / \"&Mercredi!$B10)&CHAR(10)&\"Matière : \"&Mercredi!$D10&CHAR(10)&\"Compétences : \"&Mercredi!$G10))","v":"10:00 / 10:15\nRECREATION"},{"$f":"IF(AND(Jeudi!$D10=\"\",Jeudi!$G10=\"\"),\"\",IF(Jeudi!$D10=\"Récréation\",CONCATENATE(Jeudi!$A10&\" / \"&Jeudi!$B10)&CHAR(10)&\"RECREATION\",CONCATENATE(Jeudi!$A10&\" / \"&Jeudi!$B10)&CHAR(10)&\"Matière : \"&Jeudi!$D10&CHAR(10)&\"Compétences : \"&Jeudi!$G10))","v":"9:50 / 10:15\nRECREATION"},{"$f":"IF(AND(Vendredi!$D11=\"\",Vendredi!$G11=\"\"),\"\",IF(Vendredi!$D11=\"Récréation\",CONCATENATE(Vendredi!$A10&\" / \"&Vendredi!$B10)&CHAR(10)&\"RECREATION\",CONCATENATE(Vendredi!$A10&\" / \"&Vendredi!$B10)&CHAR(10)&\"Matière : \"&Vendredi!$D11&CHAR(10)&\"Compétences : \"&Vendredi!$G11))","v":"9:50 / 10:15\nMatière : Anglais\nCompétences : Have you got + voc famille + civilisation famille royale"}]
[{"$f":"IF(AND(Lundi!$D11=\"\",Lundi!$G11=\"\"),\"\",IF(Lundi!$D11=\"Récréation\",CONCATENATE(Lundi!A11&\" / \"&Lundi!B11)&CHAR(10)&\"RECREATION\",CONCATENATE(Lundi!A11&\" / \"&Lundi!B11)&CHAR(10)&\"Matière : \"&Lundi!$D11&CHAR(10)&\"Compétences : \"&Lundi!$G11))","v":"10:15 / 11:30\nMatière : Maths Calculs\nCompétences : Maîtriser la TO de la division"},{"$f":"IF(AND(Mardi!$D11=\"\",Mardi!$G11=\"\"),\"\",IF(Mardi!$D11=\"Récréation\",CONCATENATE(Mardi!$A11&\" / \"&Mardi!$B11)&CHAR(10)&\"RECREATION\",CONCATENATE(Mardi!$A11&\" / \"&Mardi!$B11)&CHAR(10)&\"Matière : \"&Mardi!$D11&CHAR(10)&\"Compétences : \"&Mardi!$G11))","v":"11:30 / 13:45\nMatière : Pause repas\nCompétences : "},{"$f":"IF(AND(Mercredi!$D11=\"\",Mercredi!$G11=\"\"),\"\",IF(Mercredi!$D11=\"Récréation\",CONCATENATE(Mercredi!$A11&\" / \"&Mercredi!$B11)&CHAR(10)&\"RECREATION\",CONCATENATE(Mercredi!$A11&\" / \"&Mercredi!$B11)&CHAR(10)&\"Matière : \"&Mercredi!$D11&CHAR(10)&\"Compétences : \"&Mercredi!$G11))","v":"10:15 / 10:45\nMatière : Dictée\nCompétences : écrire un texte dictée dans une synthaxe et une orthographe correctes."},{"$f":"IF(AND(Jeudi!$D11=\"\",Jeudi!$G11=\"\"),\"\",IF(Jeudi!$D11=\"Récréation\",CONCATENATE(Jeudi!$A11&\" / \"&Jeudi!$B11)&CHAR(10)&\"RECREATION\",CONCATENATE(Jeudi!$A11&\" / \"&Jeudi!$B11)&CHAR(10)&\"Matière : \"&Jeudi!$D11&CHAR(10)&\"Compétences : \"&Jeudi!$G11))","v":"10:15 / 11:30\nMatière : Histoire\nCompétences : "},{"$f":"IF(AND(Vendredi!#REF!=\"\",Vendredi!#REF!=\"\"),\"\",IF(Vendredi!#REF!=\"Récréation\",CONCATENATE(Vendredi!$A11&\" / \"&Vendredi!$B11)&CHAR(10)&\"RECREATION\",CONCATENATE(Vendredi!$A11&\" / \"&Vendredi!$B11)&CHAR(10)&\"Matière : \"&Vendredi!#REF!&CHAR(10)&\"Compétences : \"&Vendredi!#REF!))","v":{"$error":"#REF!"}}]
[{"$f":"IF(AND(Lundi!$D12=\"\",Lundi!$G12=\"\"),\"\",IF(Lundi!$D12=\"Récréation\",CONCATENATE(Lundi!A12&\" / \"&Lundi!B12)&CHAR(10)&\"RECREATION\",CONCATENATE(Lundi!A12&\" / \"&Lundi!B12)&CHAR(10)&\"Matière : \"&Lundi!$D12&CHAR(10)&\"Compétences : \"&Lundi!$G12))","v":"11:30 / 13:45\nMatière : Pause repas\nCompétences : "},{"$f":"IF(AND(Mardi!$D12=\"\",Mardi!$G12=\"\"),\"\",IF(Mardi!$D12=\"Récréation\",CONCATENATE(Mardi!$A12&\" / \"&Mardi!$B12)&CHAR(10)&\"RECREATION\",CONCATENATE(Mardi!$A12&\" / \"&Mardi!$B12)&CHAR(10)&\"Matière : \"&Mardi!$D12&CHAR(10)&\"Compétences : \"&Mardi!$G12))","v":"13:45 / 15:00\nMatière : Art musical\nCompétences : Restituer un rythme appris"},{"$f":"IF(AND(Mercredi!$D12=\"\",Mercredi!$G12=\"\"),\"\",IF(Mercredi!$D12=\"Récréation\",CONCATENATE(Mercredi!$A12&\" / \"&Mercredi!$B12)&CHAR(10)&\"RECREATION\",CONCATENATE(Mercredi!$A12&\" / \"&Mercredi!$B12)&CHAR(10)&\"Matière : \"&Mercredi!$D12&CHAR(10)&\"Compétences : \"&Mercredi!$G12))","v":"10:45 / 11:30\nMatière : Arts visuels\nCompétences : Suivre un programme de construction.\nTracer un cercle.\n"},{"$f":"IF(AND(Jeudi!$D12=\"\",Jeudi!$G12=\"\"),\"\",IF(Jeudi!$D12=\"Récréation\",CONCATENATE(Jeudi!$A12&\" / \"&Jeudi!$B12)&CHAR(10)&\"RECREATION\",CONCATENATE(Jeudi!$A12&\" / \"&Jeudi!$B12)&CHAR(10)&\"Matière : \"&Jeudi!$D12&CHAR(10)&\"Compétences : \"&Jeudi!$G12))","v":"11:30 / 13:45\nMatière : Pause repas\nCompétences : "},{"$f":"IF(AND(Vendredi!$D12=\"\",Vendredi!$G12=\"\"),\"\",IF(Vendredi!$D12=\"Récréation\",CONCATENATE(Vendredi!$A12&\" / \"&Vendredi!$B12)&CHAR(10)&\"RECREATION\",CONCATENATE(Vendredi!$A12&\" / \"&Vendredi!$B12)&CHAR(10)&\"Matière : \"&Vendredi!$D12&CHAR(10)&\"Compétences : \"&Vendredi!$G12))","v":"11:30 / 13:45\nMatière : Pause repas\nCompétences : "}]
[{"$f":"IF(AND(Lundi!$D14=\"\",Lundi!$H14=\"\"),\"\",IF(Lundi!$D14=\"Récréation\",CONCATENATE(Lundi!A13&\" / \"&Lundi!B13)&CHAR(10)&\"RECREATION\",CONCATENATE(Lundi!A13&\" / \"&Lundi!B13)&CHAR(10)&\"Matière : \"&Lundi!$D14&CHAR(10)&\"Compétences : \"&Lundi!$H14))","v":"13:45 / 14:00\nMatière : EMC\nCompétences : Au regard de l'actualité, on demande aux élèves ce qu'est pour eux le rôle du président de la république et comment il est élu ?\n2) distribution des documents sur le président de la République et compléter les documents avec les élèves\n3) Bilan trace écrite sur une feuille de classeur:\nLe président de la République est élu au suffrage universel direct (élu directement par le peuple). Son mandat dure cinq ans (quinquennat). Il siège au Palais de l’Elysée (Paris). Avec le Gouvernement (les ministres), l’Assemblée Nationale (les députés) et le Sénat , il s’occupe des affaires du pays. Il est également le chef de l’armée."},{"$f":"IF(AND(Mardi!$D13=\"\",Mardi!$G13=\"\"),\"\",IF(Mardi!$D13=\"Récréation\",CONCATENATE(Mardi!$A13&\" / \"&Mardi!$B13)&CHAR(10)&\"RECREATION\",CONCATENATE(Mardi!$A13&\" / \"&Mardi!$B13)&CHAR(10)&\"Matière : \"&Mardi!$D13&CHAR(10)&\"Compétences : \"&Mardi!$G13))","v":"15:00 / 16:00\nMatière : Littérature\nCompétences : Lire et comprendre un texte.\n"},{"$f":"IF(AND(Mercredi!$D13=\"\",Mercredi!$G13=\"\"),\"\",IF(Mercredi!$D13=\"Récréation\",CONCATENATE(Mercredi!$A13&\" / \"&Mercredi!$B13)&CHAR(10)&\"RECREATION\",CONCATENATE(Mercredi!$A13&\" / \"&Mercredi!$B13)&CHAR(10)&\"Matière : \"&Mercredi!$D13&CHAR(10)&\"Compétences : \"&Mercredi!$G13))","v":""},{"$f":"IF(AND(Jeudi!$D9=\"\",Jeudi!$G9=\"\"),\"\",IF(Jeudi!$D9=\"Récréation\",CONCATENATE(Jeudi!$A13&\" / \"&Jeudi!$B13)&CHAR(10)&\"RECREATION\",CONCATENATE(Jeudi!$A13&\" / \"&Jeudi!$B13)&CHAR(10)&\"Matière : \"&Jeudi!$D9&CHAR(10)&\"Compétences : \"&Jeudi!$G9))","v":"13:45 / 14:00\nMatière : Maths Calcul\nCompétences : Résoudre des problèmes faisant intervenir des mesures de masses"},{"$f":"IF(AND(Vendredi!$D13=\"\",Vendredi!$G13=\"\"),\"\",IF(Vendredi!$D13=\"Récréation\",CONCATENATE(Vendredi!$A13&\" / \"&Vendredi!$B13)&CHAR(10)&\"RECREATION\",CONCATENATE(Vendredi!$A13&\" / \"&Vendredi!$B13)&CHAR(10)&\"Matière : \"&Vendredi!$D13&CHAR(10)&\"Compétences : \"&Vendredi!$G13))","v":"13:45 / 14:00\nMatière : Devoirs\nCompétences : "}]
[{"$f":"IF(AND(Lundi!#REF!=\"\",Lundi!#REF!=\"\"),\"\",IF(Lundi!#REF!=\"Récréation\",CONCATENATE(Lundi!A14&\" / \"&Lundi!B14)&CHAR(10)&\"RECREATION\",CONCATENATE(Lundi!A14&\" / \"&Lundi!B14)&CHAR(10)&\"Matière : \"&Lundi!#REF!&CHAR(10)&\"Compétences : \"&Lundi!#REF!))","v":{"$error":"#REF!"}},{"$f":"IF(AND(Mardi!$D14=\"\",Mardi!$G14=\"\"),\"\",IF(Mardi!$D14=\"Récréation\",CONCATENATE(Mardi!$A14&\" / \"&Mardi!$B14)&CHAR(10)&\"RECREATION\",CONCATENATE(Mardi!$A14&\" / \"&Mardi!$B14)&CHAR(10)&\"Matière : \"&Mardi!$D14&CHAR(10)&\"Compétences : \"&Mardi!$G14))","v":""},{"$f":"IF(AND(Mercredi!$D14=\"\",Mercredi!$G14=\"\"),\"\",IF(Mercredi!$D14=\"Récréation\",CONCATENATE(Mercredi!$A14&\" / \"&Mercredi!$B14)&CHAR(10)&\"RECREATION\",CONCATENATE(Mercredi!$A14&\" / \"&Mercredi!$B14)&CHAR(10)&\"Matière : \"&Mercredi!$D14&CHAR(10)&\"Compétences : \"&Mercredi!$G14))","v":""},{"$f":"IF(AND(Jeudi!#REF!=\"\",Jeudi!#REF!=\"\"),\"\",IF(Jeudi!#REF!=\"Récréation\",CONCATENATE(Jeudi!$A14&\" / \"&Jeudi!$B14)&CHAR(10)&\"RECREATION\",CONCATENATE(Jeudi!$A14&\" / \"&Jeudi!$B14)&CHAR(10)&\"Matière : \"&Jeudi!#REF!&CHAR(10)&\"Compétences : \"&Jeudi!#REF!))","v":{"$error":"#REF!"}},{"$f":"IF(AND(Vendredi!$D14=\"\",Vendredi!$G14=\"\"),\"\",IF(Vendredi!$D14=\"Récréation\",CONCATENATE(Vendredi!$A14&\" / \"&Vendredi!$B14)&CHAR(10)&\"RECREATION\",CONCATENATE(Vendredi!$A14&\" / \"&Vendredi!$B14)&CHAR(10)&\"Matière : \"&Vendredi!$D14&CHAR(10)&\"Compétences : \"&Vendredi!$G14))","v":"14:00 / 15:00\nMatière : Sciences\nCompétences : Fabriquer et tester un objet tetchnique"}]
[{"$f":"IF(AND(Lundi!$D16=\"\",Lundi!$G16=\"\"),\"\",IF(Lundi!$D16=\"Récréation\",CONCATENATE(Lundi!A15&\" / \"&Lundi!B15)&CHAR(10)&\"RECREATION\",CONCATENATE(Lundi!A15&\" / \"&Lundi!B15)&CHAR(10)&\"Matière : \"&Lundi!$D16&CHAR(10)&\"Compétences : \"&Lundi!$G16))","v":"15:00 / 15:45\nMatière : Récitation\nCompétences : Réciter un texte appris par cœur"},{"$f":"IF(AND(Mardi!$D15=\"\",Mardi!$G15=\"\"),\"\",IF(Mardi!$D15=\"Récréation\",CONCATENATE(Mardi!$A15&\" / \"&Mardi!$B15)&CHAR(10)&\"RECREATION\",CONCATENATE(Mardi!$A15&\" / \"&Mardi!$B15)&CHAR(10)&\"Matière : \"&Mardi!$D15&CHAR(10)&\"Compétences : \"&Mardi!$G15))","v":""},{"$f":"IF(AND(Mercredi!$D15=\"\",Mercredi!$G15=\"\"),\"\",IF(Mercredi!$D15=\"Récréation\",CONCATENATE(Mercredi!$A15&\" / \"&Mercredi!$B15)&CHAR(10)&\"RECREATION\",CONCATENATE(Mercredi!$A15&\" / \"&Mercredi!$B15)&CHAR(10)&\"Matière : \"&Mercredi!$D15&CHAR(10)&\"Compétences : \"&Mercredi!$G15))","v":""},{"$f":"IF(AND(Jeudi!$D15=\"\",Jeudi!$G15=\"\"),\"\",IF(Jeudi!$D15=\"Récréation\",CONCATENATE(Jeudi!$A15&\" / \"&Jeudi!$B15)&CHAR(10)&\"RECREATION\",CONCATENATE(Jeudi!$A15&\" / \"&Jeudi!$B15)&CHAR(10)&\"Matière : \"&Jeudi!$D15&CHAR(10)&\"Compétences : \"&Jeudi!$G15))","v":"14:55 / 16:00\nMatière : Géographie\nCompétences : Connaître le découpage administratif de la France."},{"$f":"IF(AND(Vendredi!$D15=\"\",Vendredi!$G15=\"\"),\"\",IF(Vendredi!$D15=\"Récréation\",CONCATENATE(Vendredi!$A15&\" / \"&Vendredi!$B15)&CHAR(10)&\"RECREATION\",CONCATENATE(Vendredi!$A15&\" / \"&Vendredi!$B15)&CHAR(10)&\"Matière : \"&Vendredi!$D15&CHAR(10)&\"Compétences : \"&Vendredi!$G15))","v":"15:00  / 15:15\nRECREATION"}]
[{"$f":"IF(AND(Lundi!#REF!=\"\",Lundi!#REF!=\"\"),\"\",IF(Lundi!#REF!=\"Récréation\",CONCATENATE(Lundi!A16&\" / \"&Lundi!B16)&CHAR(10)&\"RECREATION\",CONCATENATE(Lundi!A16&\" / \"&Lundi!B16)&CHAR(10)&\"Matière : \"&Lundi!#REF!&CHAR(10)&\"Compétences : \"&Lundi!#REF!))","v":{"$error":"#REF!"}},{"$f":"IF(AND(Mardi!$D16=\"\",Mardi!$G16=\"\"),\"\",IF(Mardi!$D16=\"Récréation\",CONCATENATE(Mardi!$A16&\" / \"&Mardi!$B16)&CHAR(10)&\"RECREATION\",CONCATENATE(Mardi!$A16&\" / \"&Mardi!$B16)&CHAR(10)&\"Matière : \"&Mardi!$D16&CHAR(10)&\"Compétences : \"&Mardi!$G16))","v":""},{"$f":"IF(AND(Mercredi!$D16=\"\",Mercredi!$G16=\"\"),\"\",IF(Mercredi!$D16=\"Récréation\",CONCATENATE(Mercredi!$A16&\" / \"&Mercredi!$B16)&CHAR(10)&\"RECREATION\",CONCATENATE(Mercredi!$A16&\" / \"&Mercredi!$B16)&CHAR(10)&\"Matière : \"&Mercredi!$D16&CHAR(10)&\"Compétences : \"&Mercredi!$G16))","v":""},{"$f":"IF(AND(Jeudi!$D16=\"\",Jeudi!$G16=\"\"),\"\",IF(Jeudi!$D16=\"Récréation\",CONCATENATE(Jeudi!$A16&\" / \"&Jeudi!$B16)&CHAR(10)&\"RECREATION\",CONCATENATE(Jeudi!$A16&\" / \"&Jeudi!$B16)&CHAR(10)&\"Matière : \"&Jeudi!$D16&CHAR(10)&\"Compétences : \"&Jeudi!$G16))","v":""},{"$f":"IF(AND(Vendredi!$D16=\"\",Vendredi!$G16=\"\"),\"\",IF(Vendredi!$D16=\"Récréation\",CONCATENATE(Vendredi!$A16&\" / \"&Vendredi!$B16)&CHAR(10)&\"RECREATION\",CONCATENATE(Vendredi!$A16&\" / \"&Vendredi!$B16)&CHAR(10)&\"Matière : \"&Vendredi!$D16&CHAR(10)&\"Compétences : \"&Vendredi!$G16))","v":"15:15 / 16:00\nMatière : Maths GdM\nCompétences : Effectuer des conversion de masse "}]
[{"$f":"IF(AND(Lundi!$D17=\"\",Lundi!$G17=\"\"),\"\",IF(Lundi!$D17=\"Récréation\",CONCATENATE(Lundi!A17&\" / \"&Lundi!B17)&CHAR(10)&\"RECREATION\",CONCATENATE(Lundi!A17&\" / \"&Lundi!B17)&CHAR(10)&\"Matière : \"&Lundi!$D17&CHAR(10)&\"Compétences : \"&Lundi!$G17))","v":""},{"$f":"IF(AND(Mardi!$D17=\"\",Mardi!$G17=\"\"),\"\",IF(Mardi!$D17=\"Récréation\",CONCATENATE(Mardi!$A17&\" / \"&Mardi!$B17)&CHAR(10)&\"RECREATION\",CONCATENATE(Mardi!$A17&\" / \"&Mardi!$B17)&CHAR(10)&\"Matière : \"&Mardi!$D17&CHAR(10)&\"Compétences : \"&Mardi!$G17))","v":""},{"$f":"IF(AND(Mercredi!$D17=\"\",Mercredi!$G17=\"\"),\"\",IF(Mercredi!$D17=\"Récréation\",CONCATENATE(Mercredi!$A17&\" / \"&Mercredi!$B17)&CHAR(10)&\"RECREATION\",CONCATENATE(Mercredi!$A17&\" / \"&Mercredi!$B17)&CHAR(10)&\"Matière : \"&Mercredi!$D17&CHAR(10)&\"Compétences : \"&Mercredi!$G17))","v":""},{"$f":"IF(AND(Jeudi!$D17=\"\",Jeudi!$G17=\"\"),\"\",IF(Jeudi!$D17=\"Récréation\",CONCATENATE(Jeudi!$A17&\" / \"&Jeudi!$B17)&CHAR(10)&\"RECREATION\",CONCATENATE(Jeudi!$A17&\" / \"&Jeudi!$B17)&CHAR(10)&\"Matière : \"&Jeudi!$D17&CHAR(10)&\"Compétences : \"&Jeudi!$G17))","v":""},{"$f":"IF(AND(Vendredi!$D17=\"\",Vendredi!$G17=\"\"),\"\",IF(Vendredi!$D17=\"Récréation\",CONCATENATE(Vendredi!$A17&\" / \"&Vendredi!$B17)&CHAR(10)&\"RECREATION\",CONCATENATE(Vendredi!$A17&\" / \"&Vendredi!$B17)&CHAR(10)&\"Matière : \"&Vendredi!$D17&CHAR(10)&\"Compétences : \"&Vendredi!$G17))","v":""}]
[{"$f":"IF(AND(Lundi!$D18=\"\",Lundi!$G18=\"\"),\"\",IF(Lundi!$D18=\"Récréation\",CONCATENATE(Lundi!A18&\" / \"&Lundi!B18)&CHAR(10)&\"RECREATION\",CONCATENATE(Lundi!A18&\" / \"&Lundi!B18)&CHAR(10)&\"Matière : \"&Lundi!$D18&CHAR(10)&\"Compétences : \"&Lundi!$G18))","v":""},{"$f":"IF(AND(Mardi!$D18=\"\",Mardi!$G18=\"\"),\"\",IF(Mardi!$D18=\"Récréation\",CONCATENATE(Mardi!$A18&\" / \"&Mardi!$B18)&CHAR(10)&\"RECREATION\",CONCATENATE(Mardi!$A18&\" / \"&Mardi!$B18)&CHAR(10)&\"Matière : \"&Mardi!$D18&CHAR(10)&\"Compétences : \"&Mardi!$G18))","v":""},{"$f":"IF(AND(Mercredi!$D18=\"\",Mercredi!$G18=\"\"),\"\",IF(Mercredi!$D18=\"Récréation\",CONCATENATE(Mercredi!$A18&\" / \"&Mercredi!$B18)&CHAR(10)&\"RECREATION\",CONCATENATE(Mercredi!$A18&\" / \"&Mercredi!$B18)&CHAR(10)&\"Matière : \"&Mercredi!$D18&CHAR(10)&\"Compétences : \"&Mercredi!$G18))","v":""},{"$f":"IF(AND(Jeudi!$D18=\"\",Jeudi!$G18=\"\"),\"\",IF(Jeudi!$D18=\"Récréation\",CONCATENATE(Jeudi!$A18&\" / \"&Jeudi!$B18)&CHAR(10)&\"RECREATION\",CONCATENATE(Jeudi!$A18&\" / \"&Jeudi!$B18)&CHAR(10)&\"Matière : \"&Jeudi!$D18&CHAR(10)&\"Compétences : \"&Jeudi!$G18))","v":""},{"$f":"IF(AND(Vendredi!$D18=\"\",Vendredi!$G18=\"\"),\"\",IF(Vendredi!$D18=\"Récréation\",CONCATENATE(Vendredi!$A18&\" / \"&Vendredi!$B18)&CHAR(10)&\"RECREATION\",CONCATENATE(Vendredi!$A18&\" / \"&Vendredi!$B18)&CHAR(10)&\"Matière : \"&Vendredi!$D18&CHAR(10)&\"Compétences : \"&Vendredi!$G18))","v":""}]
[{"$f":"IF(AND(Lundi!$D19=\"\",Lundi!$G19=\"\"),\"\",IF(Lundi!$D19=\"Récréation\",CONCATENATE(Lundi!A19&\" / \"&Lundi!B19)&CHAR(10)&\"RECREATION\",CONCATENATE(Lundi!A19&\" / \"&Lundi!B19)&CHAR(10)&\"Matière : \"&Lundi!$D19&CHAR(10)&\"Compétences : \"&Lundi!$G19))","v":""},{"$f":"IF(AND(Mardi!$D19=\"\",Mardi!$G19=\"\"),\"\",IF(Mardi!$D19=\"Récréation\",CONCATENATE(Mardi!$A19&\" / \"&Mardi!$B19)&CHAR(10)&\"RECREATION\",CONCATENATE(Mardi!$A19&\" / \"&Mardi!$B19)&CHAR(10)&\"Matière : \"&Mardi!$D19&CHAR(10)&\"Compétences : \"&Mardi!$G19))","v":""},{"$f":"IF(AND(Mercredi!$D19=\"\",Mercredi!$G19=\"\"),\"\",IF(Mercredi!$D19=\"Récréation\",CONCATENATE(Mercredi!$A19&\" / \"&Mercredi!$B19)&CHAR(10)&\"RECREATION\",CONCATENATE(Mercredi!$A19&\" / \"&Mercredi!$B19)&CHAR(10)&\"Matière : \"&Mercredi!$D19&CHAR(10)&\"Compétences : \"&Mercredi!$G19))","v":""},{"$f":"IF(AND(Jeudi!#REF!=\"\",Jeudi!#REF!=\"\"),\"\",IF(Jeudi!#REF!=\"Récréation\",CONCATENATE(Jeudi!$A19&\" / \"&Jeudi!$B19)&CHAR(10)&\"RECREATION\",CONCATENATE(Jeudi!$A19&\" / \"&Jeudi!$B19)&CHAR(10)&\"Matière : \"&Jeudi!#REF!&CHAR(10)&\"Compétences : \"&Jeudi!#REF!))","v":{"$error":"#REF!"}},{"$f":"IF(AND(Vendredi!$D19=\"\",Vendredi!$G19=\"\"),\"\",IF(Vendredi!$D19=\"Récréation\",CONCATENATE(Vendredi!$A19&\" / \"&Vendredi!$B19)&CHAR(10)&\"RECREATION\",CONCATENATE(Vendredi!$A19&\" / \"&Vendredi!$B19)&CHAR(10)&\"Matière : \"&Vendredi!$D19&CHAR(10)&\"Compétences : \"&Vendredi!$G19))","v":""}]
[{"$f":"IF(AND(Lundi!$D20=\"\",Lundi!$G20=\"\"),\"\",IF(Lundi!$D20=\"Récréation\",CONCATENATE(Lundi!A20&\" / \"&Lundi!B20)&CHAR(10)&\"RECREATION\",CONCATENATE(Lundi!A20&\" / \"&Lundi!B20)&CHAR(10)&\"Matière : \"&Lundi!$D20&CHAR(10)&\"Compétences : \"&Lundi!$G20))","v":""},{"$f":"IF(AND(Mardi!$D20=\"\",Mardi!$G20=\"\"),\"\",IF(Mardi!$D20=\"Récréation\",CONCATENATE(Mardi!$A20&\" / \"&Mardi!$B20)&CHAR(10)&\"RECREATION\",CONCATENATE(Mardi!$A20&\" / \"&Mardi!$B20)&CHAR(10)&\"Matière : \"&Mardi!$D20&CHAR(10)&\"Compétences : \"&Mardi!$G20))","v":""},{"$f":"IF(AND(Mercredi!$D20=\"\",Mercredi!$G20=\"\"),\"\",IF(Mercredi!$D20=\"Récréation\",CONCATENATE(Mercredi!$A20&\" / \"&Mercredi!$B20)&CHAR(10)&\"RECREATION\",CONCATENATE(Mercredi!$A20&\" / \"&Mercredi!$B20)&CHAR(10)&\"Matière : \"&Mercredi!$D20&CHAR(10)&\"Compétences : \"&Mercredi!$G20))","v":""},{"$f":"IF(AND(Jeudi!$D20=\"\",Jeudi!$G20=\"\"),\"\",IF(Jeudi!$D20=\"Récréation\",CONCATENATE(Jeudi!$A20&\" / \"&Jeudi!$B20)&CHAR(10)&\"RECREATION\",CONCATENATE(Jeudi!$A20&\" / \"&Jeudi!$B20)&CHAR(10)&\"Matière : \"&Jeudi!$D20&CHAR(10)&\"Compétences : \"&Jeudi!$G20))","v":""},{"$f":"IF(AND(Vendredi!$D20=\"\",Vendredi!$G20=\"\"),\"\",IF(Vendredi!$D20=\"Récréation\",CONCATENATE(Vendredi!$A20&\" / \"&Vendredi!$B20)&CHAR(10)&\"RECREATION\",CONCATENATE(Vendredi!$A20&\" / \"&Vendredi!$B20)&CHAR(10)&\"Matière : \"&Vendredi!$D20&CHAR(10)&\"Compétences : \"&Vendredi!$G20))","v":""}]
[{"$f":"IF(AND(Lundi!$D21=\"\",Lundi!$G21=\"\"),\"\",IF(Lundi!$D21=\"Récréation\",CONCATENATE(Lundi!A21&\" / \"&Lundi!B21)&CHAR(10)&\"RECREATION\",CONCATENATE(Lundi!A21&\" / \"&Lundi!B21)&CHAR(10)&\"Matière : \"&Lundi!$D21&CHAR(10)&\"Compétences : \"&Lundi!$G21))","v":""},{"$f":"IF(AND(Mardi!$D21=\"\",Mardi!$G21=\"\"),\"\",IF(Mardi!$D21=\"Récréation\",CONCATENATE(Mardi!$A21&\" / \"&Mardi!$B21)&CHAR(10)&\"RECREATION\",CONCATENATE(Mardi!$A21&\" / \"&Mardi!$B21)&CHAR(10)&\"Matière : \"&Mardi!$D21&CHAR(10)&\"Compétences : \"&Mardi!$G21))","v":""},{"$f":"IF(AND(Mercredi!$D21=\"\",Mercredi!$G21=\"\"),\"\",IF(Mercredi!$D21=\"Récréation\",CONCATENATE(Mercredi!$A21&\" / \"&Mercredi!$B21)&CHAR(10)&\"RECREATION\",CONCATENATE(Mercredi!$A21&\" / \"&Mercredi!$B21)&CHAR(10)&\"Matière : \"&Mercredi!$D21&CHAR(10)&\"Compétences : \"&Mercredi!$G21))","v":""},{"$f":"IF(AND(Jeudi!$D21=\"\",Jeudi!$G21=\"\"),\"\",IF(Jeudi!$D21=\"Récréation\",CONCATENATE(Jeudi!$A21&\" / \"&Jeudi!$B21)&CHAR(10)&\"RECREATION\",CONCATENATE(Jeudi!$A21&\" / \"&Jeudi!$B21)&CHAR(10)&\"Matière : \"&Jeudi!$D21&CHAR(10)&\"Compétences : \"&Jeudi!$G21))","v":""},{"$f":"IF(AND(Vendredi!$D21=\"\",Vendredi!$G21=\"\"),\"\",IF(Vendredi!$D21=\"Récréation\",CONCATENATE(Vendredi!$A21&\" / \"&Vendredi!$B21)&CHAR(10)&\"RECREATION\",CONCATENATE(Vendredi!$A21&\" / \"&Vendredi!$B21)&CHAR(10)&\"Matière : \"&Vendredi!$D21&CHAR(10)&\"Compétences : \"&Vendredi!$G21))","v":""}]
[{"$f":"IF(AND(Lundi!$D22=\"\",Lundi!$G22=\"\"),\"\",IF(Lundi!$D22=\"Récréation\",CONCATENATE(Lundi!A22&\" / \"&Lundi!B22)&CHAR(10)&\"RECREATION\",CONCATENATE(Lundi!A22&\" / \"&Lundi!B22)&CHAR(10)&\"Matière : \"&Lundi!$D22&CHAR(10)&\"Compétences : \"&Lundi!$G22))","v":""},{"$f":"IF(AND(Mardi!$D22=\"\",Mardi!$G22=\"\"),\"\",IF(Mardi!$D22=\"Récréation\",CONCATENATE(Mardi!$A22&\" / \"&Mardi!$B22)&CHAR(10)&\"RECREATION\",CONCATENATE(Mardi!$A22&\" / \"&Mardi!$B22)&CHAR(10)&\"Matière : \"&Mardi!$D22&CHAR(10)&\"Compétences : \"&Mardi!$G22))","v":""},{"$f":"IF(AND(Mercredi!$D22=\"\",Mercredi!$G22=\"\"),\"\",IF(Mercredi!$D22=\"Récréation\",CONCATENATE(Mercredi!$A22&\" / \"&Mercredi!$B22)&CHAR(10)&\"RECREATION\",CONCATENATE(Mercredi!$A22&\" / \"&Mercredi!$B22)&CHAR(10)&\"Matière : \"&Mercredi!$D22&CHAR(10)&\"Compétences : \"&Mercredi!$G22))","v":""},{"$f":"IF(AND(Jeudi!$D22=\"\",Jeudi!$G22=\"\"),\"\",IF(Jeudi!$D22=\"Récréation\",CONCATENATE(Jeudi!$A22&\" / \"&Jeudi!$B22)&CHAR(10)&\"RECREATION\",CONCATENATE(Jeudi!$A22&\" / \"&Jeudi!$B22)&CHAR(10)&\"Matière : \"&Jeudi!$D22&CHAR(10)&\"Compétences : \"&Jeudi!$G22))","v":""},{"$f":"IF(AND(Vendredi!$D22=\"\",Vendredi!$G22=\"\"),\"\",IF(Vendredi!$D22=\"Récréation\",CONCATENATE(Vendredi!$A22&\" / \"&Vendredi!$B22)&CHAR(10)&\"RECREATION\",CONCATENATE(Vendredi!$A22&\" / \"&Vendredi!$B22)&CHAR(10)&\"Matière : \"&Vendredi!$D22&CHAR(10)&\"Compétences : \"&Vendredi!$G22))","v":""}]
[{"$f":"IF(AND(Lundi!$D23=\"\",Lundi!$G23=\"\"),\"\",IF(Lundi!$D23=\"Récréation\",CONCATENATE(Lundi!A23&\" / \"&Lundi!B23)&CHAR(10)&\"RECREATION\",CONCATENATE(Lundi!A23&\" / \"&Lundi!B23)&CHAR(10)&\"Matière : \"&Lundi!$D23&CHAR(10)&\"Compétences : \"&Lundi!$G23))","v":""},{"$f":"IF(AND(Mardi!$D23=\"\",Mardi!$G23=\"\"),\"\",IF(Mardi!$D23=\"Récréation\",CONCATENATE(Mardi!$A23&\" / \"&Mardi!$B23)&CHAR(10)&\"RECREATION\",CONCATENATE(Mardi!$A23&\" / \"&Mardi!$B23)&CHAR(10)&\"Matière : \"&Mardi!$D23&CHAR(10)&\"Compétences : \"&Mardi!$G23))","v":""},{"$f":"IF(AND(Mercredi!$D23=\"\",Mercredi!$G23=\"\"),\"\",IF(Mercredi!$D23=\"Récréation\",CONCATENATE(Mercredi!$A23&\" / \"&Mercredi!$B23)&CHAR(10)&\"RECREATION\",CONCATENATE(Mercredi!$A23&\" / \"&Mercredi!$B23)&CHAR(10)&\"Matière : \"&Mercredi!$D23&CHAR(10)&\"Compétences : \"&Mercredi!$G23))","v":""},{"$f":"IF(AND(Jeudi!$D23=\"\",Jeudi!$G23=\"\"),\"\",IF(Jeudi!$D23=\"Récréation\",CONCATENATE(Jeudi!$A23&\" / \"&Jeudi!$B23)&CHAR(10)&\"RECREATION\",CONCATENATE(Jeudi!$A23&\" / \"&Jeudi!$B23)&CHAR(10)&\"Matière : \"&Jeudi!$D23&CHAR(10)&\"Compétences : \"&Jeudi!$G23))","v":""},{"$f":"IF(AND(Vendredi!$D23=\"\",Vendredi!$G23=\"\"),\"\",IF(Vendredi!$D23=\"Récréation\",CONCATENATE(Vendredi!$A23&\" / \"&Vendredi!$B23)&CHAR(10)&\"RECREATION\",CONCATENATE(Vendredi!$A23&\" / \"&Vendredi!$B23)&CHAR(10)&\"Matière : \"&Vendredi!$D23&CHAR(10)&\"Compétences : \"&Vendredi!$G23))","v":""}]
[{"$f":"IF(AND(Lundi!$D24=\"\",Lundi!$G24=\"\"),\"\",IF(Lundi!$D24=\"Récréation\",CONCATENATE(Lundi!A24&\" / \"&Lundi!B24)&CHAR(10)&\"RECREATION\",CONCATENATE(Lundi!A24&\" / \"&Lundi!B24)&CHAR(10)&\"Matière : \"&Lundi!$D24&CHAR(10)&\"Compétences : \"&Lundi!$G24))","v":""},{"$f":"IF(AND(Mardi!$D24=\"\",Mardi!$G24=\"\"),\"\",IF(Mardi!$D24=\"Récréation\",CONCATENATE(Mardi!$A24&\" / \"&Mardi!$B24)&CHAR(10)&\"RECREATION\",CONCATENATE(Mardi!$A24&\" / \"&Mardi!$B24)&CHAR(10)&\"Matière : \"&Mardi!$D24&CHAR(10)&\"Compétences : \"&Mardi!$G24))","v":""},{"$f":"IF(AND(Mercredi!$D24=\"\",Mercredi!$G24=\"\"),\"\",IF(Mercredi!$D24=\"Récréation\",CONCATENATE(Mercredi!$A24&\" / \"&Mercredi!$B24)&CHAR(10)&\"RECREATION\",CONCATENATE(Mercredi!$A24&\" / \"&Mercredi!$B24)&CHAR(10)&\"Matière : \"&Mercredi!$D24&CHAR(10)&\"Compétences : \"&Mercredi!$G24))","v":""},{"$f":"IF(AND(Jeudi!$D24=\"\",Jeudi!$G24=\"\"),\"\",IF(Jeudi!$D24=\"Récréation\",CONCATENATE(Jeudi!$A24&\" / \"&Jeudi!$B24)&CHAR(10)&\"RECREATION\",CONCATENATE(Jeudi!$A24&\" / \"&Jeudi!$B24)&CHAR(10)&\"Matière : \"&Jeudi!$D24&CHAR(10)&\"Compétences : \"&Jeudi!$G24))","v":""},{"$f":"IF(AND(Vendredi!$D24=\"\",Vendredi!$G24=\"\"),\"\",IF(Vendredi!$D24=\"Récréation\",CONCATENATE(Vendredi!$A24&\" / \"&Vendredi!$B24)&CHAR(10)&\"RECREATION\",CONCATENATE(Vendredi!$A24&\" / \"&Vendredi!$B24)&CHAR(10)&\"Matière : \"&Vendredi!$D24&CHAR(10)&\"Compétences : \"&Vendredi!$G24))","v":""}]
[{"$f":"IF(AND(Lundi!$D25=\"\",Lundi!$G25=\"\"),\"\",IF(Lundi!$D25=\"Récréation\",CONCATENATE(Lundi!A25&\" / \"&Lundi!B25)&CHAR(10)&\"RECREATION\",CONCATENATE(Lundi!A25&\" / \"&Lundi!B25)&CHAR(10)&\"Matière : \"&Lundi!$D25&CHAR(10)&\"Compétences : \"&Lundi!$G25))","v":""},{"$f":"IF(AND(Mardi!$D25=\"\",Mardi!$G25=\"\"),\"\",IF(Mardi!$D25=\"Récréation\",CONCATENATE(Mardi!$A25&\" / \"&Mardi!$B25)&CHAR(10)&\"RECREATION\",CONCATENATE(Mardi!$A25&\" / \"&Mardi!$B25)&CHAR(10)&\"Matière : \"&Mardi!$D25&CHAR(10)&\"Compétences : \"&Mardi!$G25))","v":""},{"$f":"IF(AND(Mercredi!$D25=\"\",Mercredi!$G25=\"\"),\"\",IF(Mercredi!$D25=\"Récréation\",CONCATENATE(Mercredi!$A25&\" / \"&Mercredi!$B25)&CHAR(10)&\"RECREATION\",CONCATENATE(Mercredi!$A25&\" / \"&Mercredi!$B25)&CHAR(10)&\"Matière : \"&Mercredi!$D25&CHAR(10)&\"Compétences : \"&Mercredi!$G25))","v":""},{"$f":"IF(AND(Jeudi!$D25=\"\",Jeudi!$G25=\"\"),\"\",IF(Jeudi!$D25=\"Récréation\",CONCATENATE(Jeudi!$A25&\" / \"&Jeudi!$B25)&CHAR(10)&\"RECREATION\",CONCATENATE(Jeudi!$A25&\" / \"&Jeudi!$B25)&CHAR(10)&\"Matière : \"&Jeudi!$D25&CHAR(10)&\"Compétences : \"&Jeudi!$G25))","v":""},{"$f":"IF(AND(Vendredi!$D25=\"\",Vendredi!$G25=\"\"),\"\",IF(Vendredi!$D25=\"Récréation\",CONCATENATE(Vendredi!$A25&\" / \"&Vendredi!$B25)&CHAR(10)&\"RECREATION\",CONCATENATE(Vendredi!$A25&\" / \"&Vendredi!$B25)&CHAR(10)&\"Matière : \"&Vendredi!$D25&CHAR(10)&\"Compétences : \"&Vendredi!$G25))","v":""}]
[{"$f":"IF(AND(Lundi!$D26=\"\",Lundi!$G26=\"\"),\"\",IF(Lundi!$D26=\"Récréation\",CONCATENATE(Lundi!A26&\" / \"&Lundi!B26)&CHAR(10)&\"RECREATION\",CONCATENATE(Lundi!A26&\" / \"&Lundi!B26)&CHAR(10)&\"Matière : \"&Lundi!$D26&CHAR(10)&\"Compétences : \"&Lundi!$G26))","v":""},{"$f":"IF(AND(Mardi!$D26=\"\",Mardi!$G26=\"\"),\"\",IF(Mardi!$D26=\"Récréation\",CONCATENATE(Mardi!$A26&\" / \"&Mardi!$B26)&CHAR(10)&\"RECREATION\",CONCATENATE(Mardi!$A26&\" / \"&Mardi!$B26)&CHAR(10)&\"Matière : \"&Mardi!$D26&CHAR(10)&\"Compétences : \"&Mardi!$G26))","v":""},{"$f":"IF(AND(Mercredi!$D26=\"\",Mercredi!$G26=\"\"),\"\",IF(Mercredi!$D26=\"Récréation\",CONCATENATE(Mercredi!$A26&\" / \"&Mercredi!$B26)&CHAR(10)&\"RECREATION\",CONCATENATE(Mercredi!$A26&\" / \"&Mercredi!$B26)&CHAR(10)&\"Matière : \"&Mercredi!$D26&CHAR(10)&\"Compétences : \"&Mercredi!$G26))","v":""},{"$f":"IF(AND(Jeudi!$D26=\"\",Jeudi!$G26=\"\"),\"\",IF(Jeudi!$D26=\"Récréation\",CONCATENATE(Jeudi!$A26&\" / \"&Jeudi!$B26)&CHAR(10)&\"RECREATION\",CONCATENATE(Jeudi!$A26&\" / \"&Jeudi!$B26)&CHAR(10)&\"Matière : \"&Jeudi!$D26&CHAR(10)&\"Compétences : \"&Jeudi!$G26))","v":""},{"$f":"IF(AND(Vendredi!$D26=\"\",Vendredi!$G26=\"\"),\"\",IF(Vendredi!$D26=\"Récréation\",CONCATENATE(Vendredi!$A26&\" / \"&Vendredi!$B26)&CHAR(10)&\"RECREATION\",CONCATENATE(Vendredi!$A26&\" / \"&Vendredi!$B26)&CHAR(10)&\"Matière : \"&Vendredi!$D26&CHAR(10)&\"Compétences : \"&Vendredi!$G26))","v":""}]
[{"$f":"IF(AND(Lundi!$D27=\"\",Lundi!$G27=\"\"),\"\",IF(Lundi!$D27=\"Récréation\",CONCATENATE(Lundi!A27&\" / \"&Lundi!B27)&CHAR(10)&\"RECREATION\",CONCATENATE(Lundi!A27&\" / \"&Lundi!B27)&CHAR(10)&\"Matière : \"&Lundi!$D27&CHAR(10)&\"Compétences : \"&Lundi!$G27))","v":""},{"$f":"IF(AND(Mardi!$D27=\"\",Mardi!$G27=\"\"),\"\",IF(Mardi!$D27=\"Récréation\",CONCATENATE(Mardi!$A27&\" / \"&Mardi!$B27)&CHAR(10)&\"RECREATION\",CONCATENATE(Mardi!$A27&\" / \"&Mardi!$B27)&CHAR(10)&\"Matière : \"&Mardi!$D27&CHAR(10)&\"Compétences : \"&Mardi!$G27))","v":""},{"$f":"IF(AND(Mercredi!$D27=\"\",Mercredi!$G27=\"\"),\"\",IF(Mercredi!$D27=\"Récréation\",CONCATENATE(Mercredi!$A27&\" / \"&Mercredi!$B27)&CHAR(10)&\"RECREATION\",CONCATENATE(Mercredi!$A27&\" / \"&Mercredi!$B27)&CHAR(10)&\"Matière : \"&Mercredi!$D27&CHAR(10)&\"Compétences : \"&Mercredi!$G27))","v":""},{"$f":"IF(AND(Jeudi!$D27=\"\",Jeudi!$G27=\"\"),\"\",IF(Jeudi!$D27=\"Récréation\",CONCATENATE(Jeudi!$A27&\" / \"&Jeudi!$B27)&CHAR(10)&\"RECREATION\",CONCATENATE(Jeudi!$A27&\" / \"&Jeudi!$B27)&CHAR(10)&\"Matière : \"&Jeudi!$D27&CHAR(10)&\"Compétences : \"&Jeudi!$G27))","v":""},{"$f":"IF(AND(Vendredi!$D27=\"\",Vendredi!$G27=\"\"),\"\",IF(Vendredi!$D27=\"Récréation\",CONCATENATE(Vendredi!$A27&\" / \"&Vendredi!$B27)&CHAR(10)&\"RECREATION\",CONCATENATE(Vendredi!$A27&\" / \"&Vendredi!$B27)&CHAR(10)&\"Matière : \"&Vendredi!$D27&CHAR(10)&\"Compétences : \"&Vendredi!$G27))","v":""}]
[{"$f":"IF(AND(Lundi!$D28=\"\",Lundi!$G28=\"\"),\"\",IF(Lundi!$D28=\"Récréation\",CONCATENATE(Lundi!A28&\" / \"&Lundi!B28)&CHAR(10)&\"RECREATION\",CONCATENATE(Lundi!A28&\" / \"&Lundi!B28)&CHAR(10)&\"Matière : \"&Lundi!$D28&CHAR(10)&\"Compétences : \"&Lundi!$G28))","v":""},{"$f":"IF(AND(Mardi!$D28=\"\",Mardi!$G28=\"\"),\"\",IF(Mardi!$D28=\"Récréation\",CONCATENATE(Mardi!$A28&\" / \"&Mardi!$B28)&CHAR(10)&\"RECREATION\",CONCATENATE(Mardi!$A28&\" / \"&Mardi!$B28)&CHAR(10)&\"Matière : \"&Mardi!$D28&CHAR(10)&\"Compétences : \"&Mardi!$G28))","v":""},{"$f":"IF(AND(Mercredi!$D28=\"\",Mercredi!$G28=\"\"),\"\",IF(Mercredi!$D28=\"Récréation\",CONCATENATE(Mercredi!$A28&\" / \"&Mercredi!$B28)&CHAR(10)&\"RECREATION\",CONCATENATE(Mercredi!$A28&\" / \"&Mercredi!$B28)&CHAR(10)&\"Matière : \"&Mercredi!$D28&CHAR(10)&\"Compétences : \"&Mercredi!$G28))","v":""},{"$f":"IF(AND(Jeudi!$D28=\"\",Jeudi!$G28=\"\"),\"\",IF(Jeudi!$D28=\"Récréation\",CONCATENATE(Jeudi!$A28&\" / \"&Jeudi!$B28)&CHAR(10)&\"RECREATION\",CONCATENATE(Jeudi!$A28&\" / \"&Jeudi!$B28)&CHAR(10)&\"Matière : \"&Jeudi!$D28&CHAR(10)&\"Compétences : \"&Jeudi!$G28))","v":""},{"$f":"IF(AND(Vendredi!$D28=\"\",Vendredi!$G28=\"\"),\"\",IF(Vendredi!$D28=\"Récréation\",CONCATENATE(Vendredi!$A28&\" / \"&Vendredi!$B28)&CHAR(10)&\"RECREATION\",CONCATENATE(Vendredi!$A28&\" / \"&Vendredi!$B28)&CHAR(10)&\"Matière : \"&Vendredi!$D28&CHAR(10)&\"Compétences : \"&Vendredi!$G28))","v":""}]
[{"$f":"IF(AND(Lundi!$D29=\"\",Lundi!$G29=\"\"),\"\",IF(Lundi!$D29=\"Récréation\",CONCATENATE(Lundi!A29&\" / \"&Lundi!B29)&CHAR(10)&\"RECREATION\",CONCATENATE(Lundi!A29&\" / \"&Lundi!B29)&CHAR(10)&\"Matière : \"&Lundi!$D29&CHAR(10)&\"Compétences : \"&Lundi!$G29))","v":""},{"$f":"IF(AND(Mardi!$D29=\"\",Mardi!$G29=\"\"),\"\",IF(Mardi!$D29=\"Récréation\",CONCATENATE(Mardi!$A29&\" / \"&Mardi!$B29)&CHAR(10)&\"RECREATION\",CONCATENATE(Mardi!$A29&\" / \"&Mardi!$B29)&CHAR(10)&\"Matière : \"&Mardi!$D29&CHAR(10)&\"Compétences : \"&Mardi!$G29))","v":""},{"$f":"IF(AND(Mercredi!$D29=\"\",Mercredi!$G29=\"\"),\"\",IF(Mercredi!$D29=\"Récréation\",CONCATENATE(Mercredi!$A29&\" / \"&Mercredi!$B29)&CHAR(10)&\"RECREATION\",CONCATENATE(Mercredi!$A29&\" / \"&Mercredi!$B29)&CHAR(10)&\"Matière : \"&Mercredi!$D29&CHAR(10)&\"Compétences : \"&Mercredi!$G29))","v":""},{"$f":"IF(AND(Jeudi!$D29=\"\",Jeudi!$G29=\"\"),\"\",IF(Jeudi!$D29=\"Récréation\",CONCATENATE(Jeudi!$A29&\" / \"&Jeudi!$B29)&CHAR(10)&\"RECREATION\",CONCATENATE(Jeudi!$A29&\" / \"&Jeudi!$B29)&CHAR(10)&\"Matière : \"&Jeudi!$D29&CHAR(10)&\"Compétences : \"&Jeudi!$G29))","v":""},{"$f":"IF(AND(Vendredi!$D29=\"\",Vendredi!$G29=\"\"),\"\",IF(Vendredi!$D29=\"Récréation\",CONCATENATE(Vendredi!$A29&\" / \"&Vendredi!$B29)&CHAR(10)&\"RECREATION\",CONCATENATE(Vendredi!$A29&\" / \"&Vendredi!$B29)&CHAR(10)&\"Matière : \"&Vendredi!$D29&CHAR(10)&\"Compétences : \"&Vendredi!$G29))","v":""}]
[{"$f":"IF(AND(Lundi!$D30=\"\",Lundi!$G30=\"\"),\"\",IF(Lundi!$D30=\"Récréation\",CONCATENATE(Lundi!A30&\" / \"&Lundi!B30)&CHAR(10)&\"RECREATION\",CONCATENATE(Lundi!A30&\" / \"&Lundi!B30)&CHAR(10)&\"Matière : \"&Lundi!$D30&CHAR(10)&\"Compétences : \"&Lundi!$G30))","v":""},{"$f":"IF(AND(Mardi!$D30=\"\",Mardi!$G30=\"\"),\"\",IF(Mardi!$D30=\"Récréation\",CONCATENATE(Mardi!$A30&\" / \"&Mardi!$B30)&CHAR(10)&\"RECREATION\",CONCATENATE(Mardi!$A30&\" / \"&Mardi!$B30)&CHAR(10)&\"Matière : \"&Mardi!$D30&CHAR(10)&\"Compétences : \"&Mardi!$G30))","v":""},{"$f":"IF(AND(Mercredi!$D30=\"\",Mercredi!$G30=\"\"),\"\",IF(Mercredi!$D30=\"Récréation\",CONCATENATE(Mercredi!$A30&\" / \"&Mercredi!$B30)&CHAR(10)&\"RECREATION\",CONCATENATE(Mercredi!$A30&\" / \"&Mercredi!$B30)&CHAR(10)&\"Matière : \"&Mercredi!$D30&CHAR(10)&\"Compétences : \"&Mercredi!$G30))","v":""},{"$f":"IF(AND(Jeudi!$D30=\"\",Jeudi!$G30=\"\"),\"\",IF(Jeudi!$D30=\"Récréation\",CONCATENATE(Jeudi!$A30&\" / \"&Jeudi!$B30)&CHAR(10)&\"RECREATION\",CONCATENATE(Jeudi!$A30&\" / \"&Jeudi!$B30)&CHAR(10)&\"Matière : \"&Jeudi!$D30&CHAR(10)&\"Compétences : \"&Jeudi!$G30))","v":""},{"$f":"IF(AND(Vendredi!$D30=\"\",Vendredi!$G30=\"\"),\"\",IF(Vendredi!$D30=\"Récréation\",CONCATENATE(Vendredi!$A30&\" / \"&Vendredi!$B30)&CHAR(10)&\"RECREATION\",CONCATENATE(Vendredi!$A30&\" / \"&Vendredi!$B30)&CHAR(10)&\"Matière : \"&Vendredi!$D30&CHAR(10)&\"Compétences : \"&Vendredi!$G30))","v":""}]
[{"$f":"IF(AND(Lundi!$D31=\"\",Lundi!$G31=\"\"),\"\",IF(Lundi!$D31=\"Récréation\",CONCATENATE(Lundi!A31&\" / \"&Lundi!B31)&CHAR(10)&\"RECREATION\",CONCATENATE(Lundi!A31&\" / \"&Lundi!B31)&CHAR(10)&\"Matière : \"&Lundi!$D31&CHAR(10)&\"Compétences : \"&Lundi!$G31))","v":""},{"$f":"IF(AND(Mardi!$D31=\"\",Mardi!$G31=\"\"),\"\",IF(Mardi!$D31=\"Récréation\",CONCATENATE(Mardi!$A31&\" / \"&Mardi!$B31)&CHAR(10)&\"RECREATION\",CONCATENATE(Mardi!$A31&\" / \"&Mardi!$B31)&CHAR(10)&\"Matière : \"&Mardi!$D31&CHAR(10)&\"Compétences : \"&Mardi!$G31))","v":""},{"$f":"IF(AND(Mercredi!$D31=\"\",Mercredi!$G31=\"\"),\"\",IF(Mercredi!$D31=\"Récréation\",CONCATENATE(Mercredi!$A31&\" / \"&Mercredi!$B31)&CHAR(10)&\"RECREATION\",CONCATENATE(Mercredi!$A31&\" / \"&Mercredi!$B31)&CHAR(10)&\"Matière : \"&Mercredi!$D31&CHAR(10)&\"Compétences : \"&Mercredi!$G31))","v":""},{"$f":"IF(AND(Jeudi!$D31=\"\",Jeudi!$G31=\"\"),\"\",IF(Jeudi!$D31=\"Récréation\",CONCATENATE(Jeudi!$A31&\" / \"&Jeudi!$B31)&CHAR(10)&\"RECREATION\",CONCATENATE(Jeudi!$A31&\" / \"&Jeudi!$B31)&CHAR(10)&\"Matière : \"&Jeudi!$D31&CHAR(10)&\"Compétences : \"&Jeudi!$G31))","v":""},{"$f":"IF(AND(Vendredi!$D31=\"\",Vendredi!$G31=\"\"),\"\",IF(Vendredi!$D31=\"Récréation\",CONCATENATE(Vendredi!$A31&\" / \"&Vendredi!$B31)&CHAR(10)&\"RECREATION\",CONCATENATE(Vendredi!$A31&\" / \"&Vendredi!$B31)&CHAR(10)&\"Matière : \"&Vendredi!$D31&CHAR(10)&\"Compétences : \"&Vendredi!$G31))","v":""}]
[{"$f":"IF(AND(Lundi!$D32=\"\",Lundi!$G32=\"\"),\"\",IF(Lundi!$D32=\"Récréation\",CONCATENATE(Lundi!A32&\" / \"&Lundi!B32)&CHAR(10)&\"RECREATION\",CONCATENATE(Lundi!A32&\" / \"&Lundi!B32)&CHAR(10)&\"Matière : \"&Lundi!$D32&CHAR(10)&\"Compétences : \"&Lundi!$G32))","v":""},{"$f":"IF(AND(Mardi!$D32=\"\",Mardi!$G32=\"\"),\"\",IF(Mardi!$D32=\"Récréation\",CONCATENATE(Mardi!$A32&\" / \"&Mardi!$B32)&CHAR(10)&\"RECREATION\",CONCATENATE(Mardi!$A32&\" / \"&Mardi!$B32)&CHAR(10)&\"Matière : \"&Mardi!$D32&CHAR(10)&\"Compétences : \"&Mardi!$G32))","v":""},{"$f":"IF(AND(Mercredi!$D32=\"\",Mercredi!$G32=\"\"),\"\",IF(Mercredi!$D32=\"Récréation\",CONCATENATE(Mercredi!$A32&\" / \"&Mercredi!$B32)&CHAR(10)&\"RECREATION\",CONCATENATE(Mercredi!$A32&\" / \"&Mercredi!$B32)&CHAR(10)&\"Matière : \"&Mercredi!$D32&CHAR(10)&\"Compétences : \"&Mercredi!$G32))","v":""},{"$f":"IF(AND(Jeudi!$D32=\"\",Jeudi!$G32=\"\"),\"\",IF(Jeudi!$D32=\"Récréation\",CONCATENATE(Jeudi!$A32&\" / \"&Jeudi!$B32)&CHAR(10)&\"RECREATION\",CONCATENATE(Jeudi!$A32&\" / \"&Jeudi!$B32)&CHAR(10)&\"Matière : \"&Jeudi!$D32&CHAR(10)&\"Compétences : \"&Jeudi!$G32))","v":""},{"$f":"IF(AND(Vendredi!$D32=\"\",Vendredi!$G32=\"\"),\"\",IF(Vendredi!$D32=\"Récréation\",CONCATENATE(Vendredi!$A32&\" / \"&Vendredi!$B32)&CHAR(10)&\"RECREATION\",CONCATENATE(Vendredi!$A32&\" / \"&Vendredi!$B32)&CHAR(10)&\"Matière : \"&Vendredi!$D32&CHAR(10)&\"Compétences : \"&Vendredi!$G32))","v":""}]
[{"$f":"IF(AND(Lundi!$D33=\"\",Lundi!$G33=\"\"),\"\",IF(Lundi!$D33=\"Récréation\",CONCATENATE(Lundi!A33&\" / \"&Lundi!B33)&CHAR(10)&\"RECREATION\",CONCATENATE(Lundi!A33&\" / \"&Lundi!B33)&CHAR(10)&\"Matière : \"&Lundi!$D33&CHAR(10)&\"Compétences : \"&Lundi!$G33))","v":""},{"$f":"IF(AND(Mardi!$D33=\"\",Mardi!$G33=\"\"),\"\",IF(Mardi!$D33=\"Récréation\",CONCATENATE(Mardi!$A33&\" / \"&Mardi!$B33)&CHAR(10)&\"RECREATION\",CONCATENATE(Mardi!$A33&\" / \"&Mardi!$B33)&CHAR(10)&\"Matière : \"&Mardi!$D33&CHAR(10)&\"Compétences : \"&Mardi!$G33))","v":""},{"$f":"IF(AND(Mercredi!$D33=\"\",Mercredi!$G33=\"\"),\"\",IF(Mercredi!$D33=\"Récréation\",CONCATENATE(Mercredi!$A33&\" / \"&Mercredi!$B33)&CHAR(10)&\"RECREATION\",CONCATENATE(Mercredi!$A33&\" / \"&Mercredi!$B33)&CHAR(10)&\"Matière : \"&Mercredi!$D33&CHAR(10)&\"Compétences : \"&Mercredi!$G33))","v":""},{"$f":"IF(AND(Jeudi!$D33=\"\",Jeudi!$G33=\"\"),\"\",IF(Jeudi!$D33=\"Récréation\",CONCATENATE(Jeudi!$A33&\" / \"&Jeudi!$B33)&CHAR(10)&\"RECREATION\",CONCATENATE(Jeudi!$A33&\" / \"&Jeudi!$B33)&CHAR(10)&\"Matière : \"&Jeudi!$D33&CHAR(10)&\"Compétences : \"&Jeudi!$G33))","v":""},{"$f":"IF(AND(Vendredi!$D33=\"\",Vendredi!$G33=\"\"),\"\",IF(Vendredi!$D33=\"Récréation\",CONCATENATE(Vendredi!$A33&\" / \"&Vendredi!$B33)&CHAR(10)&\"RECREATION\",CONCATENATE(Vendredi!$A33&\" / \"&Vendredi!$B33)&CHAR(10)&\"Matière : \"&Vendredi!$D33&CHAR(10)&\"Compétences : \"&Vendredi!$G33))","v":""}]
[{"$f":"IF(AND(Lundi!$D34=\"\",Lundi!$G34=\"\"),\"\",IF(Lundi!$D34=\"Récréation\",CONCATENATE(Lundi!A34&\" / \"&Lundi!B34)&CHAR(10)&\"RECREATION\",CONCATENATE(Lundi!A34&\" / \"&Lundi!B34)&CHAR(10)&\"Matière : \"&Lundi!$D34&CHAR(10)&\"Compétences : \"&Lundi!$G34))","v":""},{"$f":"IF(AND(Mardi!$D34=\"\",Mardi!$G34=\"\"),\"\",IF(Mardi!$D34=\"Récréation\",CONCATENATE(Mardi!$A34&\" / \"&Mardi!$B34)&CHAR(10)&\"RECREATION\",CONCATENATE(Mardi!$A34&\" / \"&Mardi!$B34)&CHAR(10)&\"Matière : \"&Mardi!$D34&CHAR(10)&\"Compétences : \"&Mardi!$G34))","v":""},{"$f":"IF(AND(Mercredi!$D34=\"\",Mercredi!$G34=\"\"),\"\",IF(Mercredi!$D34=\"Récréation\",CONCATENATE(Mercredi!$A34&\" / \"&Mercredi!$B34)&CHAR(10)&\"RECREATION\",CONCATENATE(Mercredi!$A34&\" / \"&Mercredi!$B34)&CHAR(10)&\"Matière : \"&Mercredi!$D34&CHAR(10)&\"Compétences : \"&Mercredi!$G34))","v":""},{"$f":"IF(AND(Jeudi!$D34=\"\",Jeudi!$G34=\"\"),\"\",IF(Jeudi!$D34=\"Récréation\",CONCATENATE(Jeudi!$A34&\" / \"&Jeudi!$B34)&CHAR(10)&\"RECREATION\",CONCATENATE(Jeudi!$A34&\" / \"&Jeudi!$B34)&CHAR(10)&\"Matière : \"&Jeudi!$D34&CHAR(10)&\"Compétences : \"&Jeudi!$G34))","v":""},{"$f":"IF(AND(Vendredi!$D34=\"\",Vendredi!$G34=\"\"),\"\",IF(Vendredi!$D34=\"Récréation\",CONCATENATE(Vendredi!$A34&\" / \"&Vendredi!$B34)&CHAR(10)&\"RECREATION\",CONCATENATE(Vendredi!$A34&\" / \"&Vendredi!$B34)&CHAR(10)&\"Matière : \"&Vendredi!$D34&CHAR(10)&\"Compétences : \"&Vendredi!$G34))","v":""}]
[{"$f":"IF(AND(Lundi!$D35=\"\",Lundi!$G35=\"\"),\"\",IF(Lundi!$D35=\"Récréation\",CONCATENATE(Lundi!A35&\" / \"&Lundi!B35)&CHAR(10)&\"RECREATION\",CONCATENATE(Lundi!A35&\" / \"&Lundi!B35)&CHAR(10)&\"Matière : \"&Lundi!$D35&CHAR(10)&\"Compétences : \"&Lundi!$G35))","v":""},{"$f":"IF(AND(Mardi!$D35=\"\",Mardi!$G35=\"\"),\"\",IF(Mardi!$D35=\"Récréation\",CONCATENATE(Mardi!$A35&\" / \"&Mardi!$B35)&CHAR(10)&\"RECREATION\",CONCATENATE(Mardi!$A35&\" / \"&Mardi!$B35)&CHAR(10)&\"Matière : \"&Mardi!$D35&CHAR(10)&\"Compétences : \"&Mardi!$G35))","v":""},{"$f":"IF(AND(Mercredi!$D35=\"\",Mercredi!$G35=\"\"),\"\",IF(Mercredi!$D35=\"Récréation\",CONCATENATE(Mercredi!$A35&\" / \"&Mercredi!$B35)&CHAR(10)&\"RECREATION\",CONCATENATE(Mercredi!$A35&\" / \"&Mercredi!$B35)&CHAR(10)&\"Matière : \"&Mercredi!$D35&CHAR(10)&\"Compétences : \"&Mercredi!$G35))","v":""},{"$f":"IF(AND(Jeudi!$D35=\"\",Jeudi!$G35=\"\"),\"\",IF(Jeudi!$D35=\"Récréation\",CONCATENATE(Jeudi!$A35&\" / \"&Jeudi!$B35)&CHAR(10)&\"RECREATION\",CONCATENATE(Jeudi!$A35&\" / \"&Jeudi!$B35)&CHAR(10)&\"Matière : \"&Jeudi!$D35&CHAR(10)&\"Compétences : \"&Jeudi!$G35))","v":""},{"$f":"IF(AND(Vendredi!$D35=\"\",Vendredi!$G35=\"\"),\"\",IF(Vendredi!$D35=\"Récréation\",CONCATENATE(Vendredi!$A35&\" / \"&Vendredi!$B35)&CHAR(10)&\"RECREATION\",CONCATENATE(Vendredi!$A35&\" / \"&Vendredi!$B35)&CHAR(10)&\"Matière : \"&Vendredi!$D35&CHAR(10)&\"Compétences : \"&Vendredi!$G35))","v":""}]
[{"$f":"IF(AND(Lundi!$D36=\"\",Lundi!$G36=\"\"),\"\",IF(Lundi!$D36=\"Récréation\",CONCATENATE(Lundi!A36&\" / \"&Lundi!B36)&CHAR(10)&\"RECREATION\",CONCATENATE(Lundi!A36&\" / \"&Lundi!B36)&CHAR(10)&\"Matière : \"&Lundi!$D36&CHAR(10)&\"Compétences : \"&Lundi!$G36))","v":""},{"$f":"IF(AND(Mardi!$D36=\"\",Mardi!$G36=\"\"),\"\",IF(Mardi!$D36=\"Récréation\",CONCATENATE(Mardi!$A36&\" / \"&Mardi!$B36)&CHAR(10)&\"RECREATION\",CONCATENATE(Mardi!$A36&\" / \"&Mardi!$B36)&CHAR(10)&\"Matière : \"&Mardi!$D36&CHAR(10)&\"Compétences : \"&Mardi!$G36))","v":""},{"$f":"IF(AND(Mercredi!$D36=\"\",Mercredi!$G36=\"\"),\"\",IF(Mercredi!$D36=\"Récréation\",CONCATENATE(Mercredi!$A36&\" / \"&Mercredi!$B36)&CHAR(10)&\"RECREATION\",CONCATENATE(Mercredi!$A36&\" / \"&Mercredi!$B36)&CHAR(10)&\"Matière : \"&Mercredi!$D36&CHAR(10)&\"Compétences : \"&Mercredi!$G36))","v":""},{"$f":"IF(AND(Jeudi!$D36=\"\",Jeudi!$G36=\"\"),\"\",IF(Jeudi!$D36=\"Récréation\",CONCATENATE(Jeudi!$A36&\" / \"&Jeudi!$B36)&CHAR(10)&\"RECREATION\",CONCATENATE(Jeudi!$A36&\" / \"&Jeudi!$B36)&CHAR(10)&\"Matière : \"&Jeudi!$D36&CHAR(10)&\"Compétences : \"&Jeudi!$G36))","v":""},{"$f":"IF(AND(Vendredi!$D36=\"\",Vendredi!$G36=\"\"),\"\",IF(Vendredi!$D36=\"Récréation\",CONCATENATE(Vendredi!$A36&\" / \"&Vendredi!$B36)&CHAR(10)&\"RECREATION\",CONCATENATE(Vendredi!$A36&\" / \"&Vendredi!$B36)&CHAR(10)&\"Matière : \"&Vendredi!$D36&CHAR(10)&\"Compétences : \"&Vendredi!$G36))","v":""}]
[{"$f":"IF(AND(Lundi!$D37=\"\",Lundi!$G37=\"\"),\"\",IF(Lundi!$D37=\"Récréation\",CONCATENATE(Lundi!A37&\" / \"&Lundi!B37)&CHAR(10)&\"RECREATION\",CONCATENATE(Lundi!A37&\" / \"&Lundi!B37)&CHAR(10)&\"Matière : \"&Lundi!$D37&CHAR(10)&\"Compétences : \"&Lundi!$G37))","v":""},{"$f":"IF(AND(Mardi!$D37=\"\",Mardi!$G37=\"\"),\"\",IF(Mardi!$D37=\"Récréation\",CONCATENATE(Mardi!$A37&\" / \"&Mardi!$B37)&CHAR(10)&\"RECREATION\",CONCATENATE(Mardi!$A37&\" / \"&Mardi!$B37)&CHAR(10)&\"Matière : \"&Mardi!$D37&CHAR(10)&\"Compétences : \"&Mardi!$G37))","v":""},{"$f":"IF(AND(Mercredi!$D37=\"\",Mercredi!$G37=\"\"),\"\",IF(Mercredi!$D37=\"Récréation\",CONCATENATE(Mercredi!$A37&\" / \"&Mercredi!$B37)&CHAR(10)&\"RECREATION\",CONCATENATE(Mercredi!$A37&\" / \"&Mercredi!$B37)&CHAR(10)&\"Matière : \"&Mercredi!$D37&CHAR(10)&\"Compétences : \"&Mercredi!$G37))","v":""},{"$f":"IF(AND(Jeudi!$D37=\"\",Jeudi!$G37=\"\"),\"\",IF(Jeudi!$D37=\"Récréation\",CONCATENATE(Jeudi!$A37&\" / \"&Jeudi!$B37)&CHAR(10)&\"RECREATION\",CONCATENATE(Jeudi!$A37&\" / \"&Jeudi!$B37)&CHAR(10)&\"Matière : \"&Jeudi!$D37&CHAR(10)&\"Compétences : \"&Jeudi!$G37))","v":""},{"$f":"IF(AND(Vendredi!$D37=\"\",Vendredi!$G37=\"\"),\"\",IF(Vendredi!$D37=\"Récréation\",CONCATENATE(Vendredi!$A37&\" / \"&Vendredi!$B37)&CHAR(10)&\"RECREATION\",CONCATENATE(Vendredi!$A37&\" / \"&Vendredi!$B37)&CHAR(10)&\"Matière : \"&Vendredi!$D37&CHAR(10)&\"Compétences : \"&Vendredi!$G37))","v":""}]
[{"$f":"IF(AND(Lundi!$D38=\"\",Lundi!$G38=\"\"),\"\",IF(Lundi!$D38=\"Récréation\",CONCATENATE(Lundi!A38&\" / \"&Lundi!B38)&CHAR(10)&\"RECREATION\",CONCATENATE(Lundi!A38&\" / \"&Lundi!B38)&CHAR(10)&\"Matière : \"&Lundi!$D38&CHAR(10)&\"Compétences : \"&Lundi!$G38))","v":""},{"$f":"IF(AND(Mardi!$D38=\"\",Mardi!$G38=\"\"),\"\",IF(Mardi!$D38=\"Récréation\",CONCATENATE(Mardi!$A38&\" / \"&Mardi!$B38)&CHAR(10)&\"RECREATION\",CONCATENATE(Mardi!$A38&\" / \"&Mardi!$B38)&CHAR(10)&\"Matière : \"&Mardi!$D38&CHAR(10)&\"Compétences : \"&Mardi!$G38))","v":""},{"$f":"IF(AND(Mercredi!$D38=\"\",Mercredi!$G38=\"\"),\"\",IF(Mercredi!$D38=\"Récréation\",CONCATENATE(Mercredi!$A38&\" / \"&Mercredi!$B38)&CHAR(10)&\"RECREATION\",CONCATENATE(Mercredi!$A38&\" / \"&Mercredi!$B38)&CHAR(10)&\"Matière : \"&Mercredi!$D38&CHAR(10)&\"Compétences : \"&Mercredi!$G38))","v":""},{"$f":"IF(AND(Jeudi!$D38=\"\",Jeudi!$G38=\"\"),\"\",IF(Jeudi!$D38=\"Récréation\",CONCATENATE(Jeudi!$A38&\" / \"&Jeudi!$B38)&CHAR(10)&\"RECREATION\",CONCATENATE(Jeudi!$A38&\" / \"&Jeudi!$B38)&CHAR(10)&\"Matière : \"&Jeudi!$D38&CHAR(10)&\"Compétences : \"&Jeudi!$G38))","v":""},{"$f":"IF(AND(Vendredi!$D38=\"\",Vendredi!$G38=\"\"),\"\",IF(Vendredi!$D38=\"Récréation\",CONCATENATE(Vendredi!$A38&\" / \"&Vendredi!$B38)&CHAR(10)&\"RECREATION\",CONCATENATE(Vendredi!$A38&\" / \"&Vendredi!$B38)&CHAR(10)&\"Matière : \"&Vendredi!$D38&CHAR(10)&\"Compétences : \"&Vendredi!$G38))","v":""}]
[{"$f":"IF(AND(Lundi!$D39=\"\",Lundi!$G39=\"\"),\"\",IF(Lundi!$D39=\"Récréation\",CONCATENATE(Lundi!A39&\" / \"&Lundi!B39)&CHAR(10)&\"RECREATION\",CONCATENATE(Lundi!A39&\" / \"&Lundi!B39)&CHAR(10)&\"Matière : \"&Lundi!$D39&CHAR(10)&\"Compétences : \"&Lundi!$G39))","v":""},{"$f":"IF(AND(Mardi!$D39=\"\",Mardi!$G39=\"\"),\"\",IF(Mardi!$D39=\"Récréation\",CONCATENATE(Mardi!$A39&\" / \"&Mardi!$B39)&CHAR(10)&\"RECREATION\",CONCATENATE(Mardi!$A39&\" / \"&Mardi!$B39)&CHAR(10)&\"Matière : \"&Mardi!$D39&CHAR(10)&\"Compétences : \"&Mardi!$G39))","v":""},{"$f":"IF(AND(Mercredi!$D39=\"\",Mercredi!$G39=\"\"),\"\",IF(Mercredi!$D39=\"Récréation\",CONCATENATE(Mercredi!$A39&\" / \"&Mercredi!$B39)&CHAR(10)&\"RECREATION\",CONCATENATE(Mercredi!$A39&\" / \"&Mercredi!$B39)&CHAR(10)&\"Matière : \"&Mercredi!$D39&CHAR(10)&\"Compétences : \"&Mercredi!$G39))","v":""},{"$f":"IF(AND(Jeudi!$D39=\"\",Jeudi!$G39=\"\"),\"\",IF(Jeudi!$D39=\"Récréation\",CONCATENATE(Jeudi!$A39&\" / \"&Jeudi!$B39)&CHAR(10)&\"RECREATION\",CONCATENATE(Jeudi!$A39&\" / \"&Jeudi!$B39)&CHAR(10)&\"Matière : \"&Jeudi!$D39&CHAR(10)&\"Compétences : \"&Jeudi!$G39))","v":""},{"$f":"IF(AND(Vendredi!$D39=\"\",Vendredi!$G39=\"\"),\"\",IF(Vendredi!$D39=\"Récréation\",CONCATENATE(Vendredi!$A39&\" / \"&Vendredi!$B39)&CHAR(10)&\"RECREATION\",CONCATENATE(Vendredi!$A39&\" / \"&Vendredi!$B39)&CHAR(10)&\"Matière : \"&Vendredi!$D39&CHAR(10)&\"Compétences : \"&Vendredi!$G39))","v":""}]
[{"$f":"IF(AND(Lundi!$D40=\"\",Lundi!$G40=\"\"),\"\",IF(Lundi!$D40=\"Récréation\",CONCATENATE(Lundi!A40&\" / \"&Lundi!B40)&CHAR(10)&\"RECREATION\",CONCATENATE(Lundi!A40&\" / \"&Lundi!B40)&CHAR(10)&\"Matière : \"&Lundi!$D40&CHAR(10)&\"Compétences : \"&Lundi!$G40))","v":""},{"$f":"IF(AND(Mardi!$D40=\"\",Mardi!$G40=\"\"),\"\",IF(Mardi!$D40=\"Récréation\",CONCATENATE(Mardi!$A40&\" / \"&Mardi!$B40)&CHAR(10)&\"RECREATION\",CONCATENATE(Mardi!$A40&\" / \"&Mardi!$B40)&CHAR(10)&\"Matière : \"&Mardi!$D40&CHAR(10)&\"Compétences : \"&Mardi!$G40))","v":""},{"$f":"IF(AND(Mercredi!$D40=\"\",Mercredi!$G40=\"\"),\"\",IF(Mercredi!$D40=\"Récréation\",CONCATENATE(Mercredi!$A40&\" / \"&Mercredi!$B40)&CHAR(10)&\"RECREATION\",CONCATENATE(Mercredi!$A40&\" / \"&Mercredi!$B40)&CHAR(10)&\"Matière : \"&Mercredi!$D40&CHAR(10)&\"Compétences : \"&Mercredi!$G40))","v":""},{"$f":"IF(AND(Jeudi!$D40=\"\",Jeudi!$G40=\"\"),\"\",IF(Jeudi!$D40=\"Récréation\",CONCATENATE(Jeudi!$A40&\" / \"&Jeudi!$B40)&CHAR(10)&\"RECREATION\",CONCATENATE(Jeudi!$A40&\" / \"&Jeudi!$B40)&CHAR(10)&\"Matière : \"&Jeudi!$D40&CHAR(10)&\"Compétences : \"&Jeudi!$G40))","v":""},{"$f":"IF(AND(Vendredi!$D40=\"\",Vendredi!$G40=\"\"),\"\",IF(Vendredi!$D40=\"Récréation\",CONCATENATE(Vendredi!$A40&\" / \"&Vendredi!$B40)&CHAR(10)&\"RECREATION\",CONCATENATE(Vendredi!$A40&\" / \"&Vendredi!$B40)&CHAR(10)&\"Matière : \"&Vendredi!$D40&CHAR(10)&\"Compétences : \"&Vendredi!$G40))","v":""}]
[{"$f":"IF(AND(Lundi!$D41=\"\",Lundi!$G41=\"\"),\"\",IF(Lundi!$D41=\"Récréation\",CONCATENATE(Lundi!A41&\" / \"&Lundi!B41)&CHAR(10)&\"RECREATION\",CONCATENATE(Lundi!A41&\" / \"&Lundi!B41)&CHAR(10)&\"Matière : \"&Lundi!$D41&CHAR(10)&\"Compétences : \"&Lundi!$G41))","v":""},{"$f":"IF(AND(Mardi!$D41=\"\",Mardi!$G41=\"\"),\"\",IF(Mardi!$D41=\"Récréation\",CONCATENATE(Mardi!$A41&\" / \"&Mardi!$B41)&CHAR(10)&\"RECREATION\",CONCATENATE(Mardi!$A41&\" / \"&Mardi!$B41)&CHAR(10)&\"Matière : \"&Mardi!$D41&CHAR(10)&\"Compétences : \"&Mardi!$G41))","v":""},{"$f":"IF(AND(Mercredi!$D41=\"\",Mercredi!$G41=\"\"),\"\",IF(Mercredi!$D41=\"Récréation\",CONCATENATE(Mercredi!$A41&\" / \"&Mercredi!$B41)&CHAR(10)&\"RECREATION\",CONCATENATE(Mercredi!$A41&\" / \"&Mercredi!$B41)&CHAR(10)&\"Matière : \"&Mercredi!$D41&CHAR(10)&\"Compétences : \"&Mercredi!$G41))","v":""},{"$f":"IF(AND(Jeudi!$D41=\"\",Jeudi!$G41=\"\"),\"\",IF(Jeudi!$D41=\"Récréation\",CONCATENATE(Jeudi!$A41&\" / \"&Jeudi!$B41)&CHAR(10)&\"RECREATION\",CONCATENATE(Jeudi!$A41&\" / \"&Jeudi!$B41)&CHAR(10)&\"Matière : \"&Jeudi!$D41&CHAR(10)&\"Compétences : \"&Jeudi!$G41))","v":""},{"$f":"IF(AND(Vendredi!$D41=\"\",Vendredi!$G41=\"\"),\"\",IF(Vendredi!$D41=\"Récréation\",CONCATENATE(Vendredi!$A41&\" / \"&Vendredi!$B41)&CHAR(10)&\"RECREATION\",CONCATENATE(Vendredi!$A41&\" / \"&Vendredi!$B41)&CHAR(10)&\"Matière : \"&Vendredi!$D41&CHAR(10)&\"Compétences : \"&Vendredi!$G41))","v":""}]
[{"$f":"IF(AND(Lundi!$D42=\"\",Lundi!$G42=\"\"),\"\",IF(Lundi!$D42=\"Récréation\",CONCATENATE(Lundi!A42&\" / \"&Lundi!B42)&CHAR(10)&\"RECREATION\",CONCATENATE(Lundi!A42&\" / \"&Lundi!B42)&CHAR(10)&\"Matière : \"&Lundi!$D42&CHAR(10)&\"Compétences : \"&Lundi!$G42))","v":""},{"$f":"IF(AND(Mardi!$D42=\"\",Mardi!$G42=\"\"),\"\",IF(Mardi!$D42=\"Récréation\",CONCATENATE(Mardi!$A42&\" / \"&Mardi!$B42)&CHAR(10)&\"RECREATION\",CONCATENATE(Mardi!$A42&\" / \"&Mardi!$B42)&CHAR(10)&\"Matière : \"&Mardi!$D42&CHAR(10)&\"Compétences : \"&Mardi!$G42))","v":""},{"$f":"IF(AND(Mercredi!$D42=\"\",Mercredi!$G42=\"\"),\"\",IF(Mercredi!$D42=\"Récréation\",CONCATENATE(Mercredi!$A42&\" / \"&Mercredi!$B42)&CHAR(10)&\"RECREATION\",CONCATENATE(Mercredi!$A42&\" / \"&Mercredi!$B42)&CHAR(10)&\"Matière : \"&Mercredi!$D42&CHAR(10)&\"Compétences : \"&Mercredi!$G42))","v":""},{"$f":"IF(AND(Jeudi!$D42=\"\",Jeudi!$G42=\"\"),\"\",IF(Jeudi!$D42=\"Récréation\",CONCATENATE(Jeudi!$A42&\" / \"&Jeudi!$B42)&CHAR(10)&\"RECREATION\",CONCATENATE(Jeudi!$A42&\" / \"&Jeudi!$B42)&CHAR(10)&\"Matière : \"&Jeudi!$D42&CHAR(10)&\"Compétences : \"&Jeudi!$G42))","v":""},{"$f":"IF(AND(Vendredi!$D42=\"\",Vendredi!$G42=\"\"),\"\",IF(Vendredi!$D42=\"Récréation\",CONCATENATE(Vendredi!$A42&\" / \"&Vendredi!$B42)&CHAR(10)&\"RECREATION\",CONCATENATE(Vendredi!$A42&\" / \"&Vendredi!$B42)&CHAR(10)&\"Matière : \"&Vendredi!$D42&CHAR(10)&\"Compétences : \"&Vendredi!$G42))","v":""}]
[{"$f":"IF(AND(Lundi!$D43=\"\",Lundi!$G43=\"\"),\"\",IF(Lundi!$D43=\"Récréation\",CONCATENATE(Lundi!A43&\" / \"&Lundi!B43)&CHAR(10)&\"RECREATION\",CONCATENATE(Lundi!A43&\" / \"&Lundi!B43)&CHAR(10)&\"Matière : \"&Lundi!$D43&CHAR(10)&\"Compétences : \"&Lundi!$G43))","v":""},{"$f":"IF(AND(Mardi!$D43=\"\",Mardi!$G43=\"\"),\"\",IF(Mardi!$D43=\"Récréation\",CONCATENATE(Mardi!$A43&\" / \"&Mardi!$B43)&CHAR(10)&\"RECREATION\",CONCATENATE(Mardi!$A43&\" / \"&Mardi!$B43)&CHAR(10)&\"Matière : \"&Mardi!$D43&CHAR(10)&\"Compétences : \"&Mardi!$G43))","v":""},{"$f":"IF(AND(Mercredi!$D43=\"\",Mercredi!$G43=\"\"),\"\",IF(Mercredi!$D43=\"Récréation\",CONCATENATE(Mercredi!$A43&\" / \"&Mercredi!$B43)&CHAR(10)&\"RECREATION\",CONCATENATE(Mercredi!$A43&\" / \"&Mercredi!$B43)&CHAR(10)&\"Matière : \"&Mercredi!$D43&CHAR(10)&\"Compétences : \"&Mercredi!$G43))","v":""},{"$f":"IF(AND(Jeudi!$D43=\"\",Jeudi!$G43=\"\"),\"\",IF(Jeudi!$D43=\"Récréation\",CONCATENATE(Jeudi!$A43&\" / \"&Jeudi!$B43)&CHAR(10)&\"RECREATION\",CONCATENATE(Jeudi!$A43&\" / \"&Jeudi!$B43)&CHAR(10)&\"Matière : \"&Jeudi!$D43&CHAR(10)&\"Compétences : \"&Jeudi!$G43))","v":""},{"$f":"IF(AND(Vendredi!$D43=\"\",Vendredi!$G43=\"\"),\"\",IF(Vendredi!$D43=\"Récréation\",CONCATENATE(Vendredi!$A43&\" / \"&Vendredi!$B43)&CHAR(10)&\"RECREATION\",CONCATENATE(Vendredi!$A43&\" / \"&Vendredi!$B43)&CHAR(10)&\"Matière : \"&Vendredi!$D43&CHAR(10)&\"Compétences : \"&Vendredi!$G43))","v":""}]
[{"$f":"IF(AND(Lundi!$D44=\"\",Lundi!$G44=\"\"),\"\",IF(Lundi!$D44=\"Récréation\",CONCATENATE(Lundi!A44&\" / \"&Lundi!B44)&CHAR(10)&\"RECREATION\",CONCATENATE(Lundi!A44&\" / \"&Lundi!B44)&CHAR(10)&\"Matière : \"&Lundi!$D44&CHAR(10)&\"Compétences : \"&Lundi!$G44))","v":""},{"$f":"IF(AND(Mardi!$D44=\"\",Mardi!$G44=\"\"),\"\",IF(Mardi!$D44=\"Récréation\",CONCATENATE(Mardi!$A44&\" / \"&Mardi!$B44)&CHAR(10)&\"RECREATION\",CONCATENATE(Mardi!$A44&\" / \"&Mardi!$B44)&CHAR(10)&\"Matière : \"&Mardi!$D44&CHAR(10)&\"Compétences : \"&Mardi!$G44))","v":""},{"$f":"IF(AND(Mercredi!$D44=\"\",Mercredi!$G44=\"\"),\"\",IF(Mercredi!$D44=\"Récréation\",CONCATENATE(Mercredi!$A44&\" / \"&Mercredi!$B44)&CHAR(10)&\"RECREATION\",CONCATENATE(Mercredi!$A44&\" / \"&Mercredi!$B44)&CHAR(10)&\"Matière : \"&Mercredi!$D44&CHAR(10)&\"Compétences : \"&Mercredi!$G44))","v":""},{"$f":"IF(AND(Jeudi!$D44=\"\",Jeudi!$G44=\"\"),\"\",IF(Jeudi!$D44=\"Récréation\",CONCATENATE(Jeudi!$A44&\" / \"&Jeudi!$B44)&CHAR(10)&\"RECREATION\",CONCATENATE(Jeudi!$A44&\" / \"&Jeudi!$B44)&CHAR(10)&\"Matière : \"&Jeudi!$D44&CHAR(10)&\"Compétences : \"&Jeudi!$G44))","v":""},{"$f":"IF(AND(Vendredi!$D44=\"\",Vendredi!$G44=\"\"),\"\",IF(Vendredi!$D44=\"Récréation\",CONCATENATE(Vendredi!$A44&\" / \"&Vendredi!$B44)&CHAR(10)&\"RECREATION\",CONCATENATE(Vendredi!$A44&\" / \"&Vendredi!$B44)&CHAR(10)&\"Matière : \"&Vendredi!$D44&CHAR(10)&\"Compétences : \"&Vendredi!$G44))","v":""}]
[{"$f":"IF(AND(Lundi!$D45=\"\",Lundi!$G45=\"\"),\"\",IF(Lundi!$D45=\"Récréation\",CONCATENATE(Lundi!A45&\" / \"&Lundi!B45)&CHAR(10)&\"RECREATION\",CONCATENATE(Lundi!A45&\" / \"&Lundi!B45)&CHAR(10)&\"Matière : \"&Lundi!$D45&CHAR(10)&\"Compétences : \"&Lundi!$G45))","v":""},{"$f":"IF(AND(Mardi!$D45=\"\",Mardi!$G45=\"\"),\"\",IF(Mardi!$D45=\"Récréation\",CONCATENATE(Mardi!$A45&\" / \"&Mardi!$B45)&CHAR(10)&\"RECREATION\",CONCATENATE(Mardi!$A45&\" / \"&Mardi!$B45)&CHAR(10)&\"Matière : \"&Mardi!$D45&CHAR(10)&\"Compétences : \"&Mardi!$G45))","v":""},{"$f":"IF(AND(Mercredi!$D45=\"\",Mercredi!$G45=\"\"),\"\",IF(Mercredi!$D45=\"Récréation\",CONCATENATE(Mercredi!$A45&\" / \"&Mercredi!$B45)&CHAR(10)&\"RECREATION\",CONCATENATE(Mercredi!$A45&\" / \"&Mercredi!$B45)&CHAR(10)&\"Matière : \"&Mercredi!$D45&CHAR(10)&\"Compétences : \"&Mercredi!$G45))","v":""},{"$f":"IF(AND(Jeudi!$D45=\"\",Jeudi!$G45=\"\"),\"\",IF(Jeudi!$D45=\"Récréation\",CONCATENATE(Jeudi!$A45&\" / \"&Jeudi!$B45)&CHAR(10)&\"RECREATION\",CONCATENATE(Jeudi!$A45&\" / \"&Jeudi!$B45)&CHAR(10)&\"Matière : \"&Jeudi!$D45&CHAR(10)&\"Compétences : \"&Jeudi!$G45))","v":""},{"$f":"IF(AND(Vendredi!$D45=\"\",Vendredi!$G45=\"\"),\"\",IF(Vendredi!$D45=\"Récréation\",CONCATENATE(Vendredi!$A45&\" / \"&Vendredi!$B45)&CHAR(10)&\"RECREATION\",CONCATENATE(Vendredi!$A45&\" / \"&Vendredi!$B45)&CHAR(10)&\"Matière : \"&Vendredi!$D45&CHAR(10)&\"Compétences : \"&Vendredi!$G45))","v":""}]
[{"$f":"IF(AND(Lundi!$D46=\"\",Lundi!$G46=\"\"),\"\",IF(Lundi!$D46=\"Récréation\",CONCATENATE(Lundi!A46&\" / \"&Lundi!B46)&CHAR(10)&\"RECREATION\",CONCATENATE(Lundi!A46&\" / \"&Lundi!B46)&CHAR(10)&\"Matière : \"&Lundi!$D46&CHAR(10)&\"Compétences : \"&Lundi!$G46))","v":""},{"$f":"IF(AND(Mardi!$D46=\"\",Mardi!$G46=\"\"),\"\",IF(Mardi!$D46=\"Récréation\",CONCATENATE(Mardi!$A46&\" / \"&Mardi!$B46)&CHAR(10)&\"RECREATION\",CONCATENATE(Mardi!$A46&\" / \"&Mardi!$B46)&CHAR(10)&\"Matière : \"&Mardi!$D46&CHAR(10)&\"Compétences : \"&Mardi!$G46))","v":""},{"$f":"IF(AND(Mercredi!$D46=\"\",Mercredi!$G46=\"\"),\"\",IF(Mercredi!$D46=\"Récréation\",CONCATENATE(Mercredi!$A46&\" / \"&Mercredi!$B46)&CHAR(10)&\"RECREATION\",CONCATENATE(Mercredi!$A46&\" / \"&Mercredi!$B46)&CHAR(10)&\"Matière : \"&Mercredi!$D46&CHAR(10)&\"Compétences : \"&Mercredi!$G46))","v":""},{"$f":"IF(AND(Jeudi!$D46=\"\",Jeudi!$G46=\"\"),\"\",IF(Jeudi!$D46=\"Récréation\",CONCATENATE(Jeudi!$A46&\" / \"&Jeudi!$B46)&CHAR(10)&\"RECREATION\",CONCATENATE(Jeudi!$A46&\" / \"&Jeudi!$B46)&CHAR(10)&\"Matière : \"&Jeudi!$D46&CHAR(10)&\"Compétences : \"&Jeudi!$G46))","v":""},{"$f":"IF(AND(Vendredi!$D46=\"\",Vendredi!$G46=\"\"),\"\",IF(Vendredi!$D46=\"Récréation\",CONCATENATE(Vendredi!$A46&\" / \"&Vendredi!$B46)&CHAR(10)&\"RECREATION\",CONCATENATE(Vendredi!$A46&\" / \"&Vendredi!$B46)&CHAR(10)&\"Matière : \"&Vendredi!$D46&CHAR(10)&\"Compétences : \"&Vendredi!$G46))","v":""}]
[{"$f":"IF(AND(Lundi!$D47=\"\",Lundi!$G47=\"\"),\"\",IF(Lundi!$D47=\"Récréation\",CONCATENATE(Lundi!A47&\" / \"&Lundi!B47)&CHAR(10)&\"RECREATION\",CONCATENATE(Lundi!A47&\" / \"&Lundi!B47)&CHAR(10)&\"Matière : \"&Lundi!$D47&CHAR(10)&\"Compétences : \"&Lundi!$G47))","v":""},{"$f":"IF(AND(Mardi!$D47=\"\",Mardi!$G47=\"\"),\"\",IF(Mardi!$D47=\"Récréation\",CONCATENATE(Mardi!$A47&\" / \"&Mardi!$B47)&CHAR(10)&\"RECREATION\",CONCATENATE(Mardi!$A47&\" / \"&Mardi!$B47)&CHAR(10)&\"Matière : \"&Mardi!$D47&CHAR(10)&\"Compétences : \"&Mardi!$G47))","v":""},{"$f":"IF(AND(Mercredi!$D47=\"\",Mercredi!$G47=\"\"),\"\",IF(Mercredi!$D47=\"Récréation\",CONCATENATE(Mercredi!$A47&\" / \"&Mercredi!$B47)&CHAR(10)&\"RECREATION\",CONCATENATE(Mercredi!$A47&\" / \"&Mercredi!$B47)&CHAR(10)&\"Matière : \"&Mercredi!$D47&CHAR(10)&\"Compétences : \"&Mercredi!$G47))","v":""},{"$f":"IF(AND(Jeudi!$D47=\"\",Jeudi!$G47=\"\"),\"\",IF(Jeudi!$D47=\"Récréation\",CONCATENATE(Jeudi!$A47&\" / \"&Jeudi!$B47)&CHAR(10)&\"RECREATION\",CONCATENATE(Jeudi!$A47&\" / \"&Jeudi!$B47)&CHAR(10)&\"Matière : \"&Jeudi!$D47&CHAR(10)&\"Compétences : \"&Jeudi!$G47))","v":""},{"$f":"IF(AND(Vendredi!$D47=\"\",Vendredi!$G47=\"\"),\"\",IF(Vendredi!$D47=\"Récréation\",CONCATENATE(Vendredi!$A47&\" / \"&Vendredi!$B47)&CHAR(10)&\"RECREATION\",CONCATENATE(Vendredi!$A47&\" / \"&Vendredi!$B47)&CHAR(10)&\"Matière : \"&Vendredi!$D47&CHAR(10)&\"Compétences : \"&Vendredi!$G47))","v":""}]
[{"$f":"IF(AND(Lundi!$D48=\"\",Lundi!$G48=\"\"),\"\",IF(Lundi!$D48=\"Récréation\",CONCATENATE(Lundi!A48&\" / \"&Lundi!B48)&CHAR(10)&\"RECREATION\",CONCATENATE(Lundi!A48&\" / \"&Lundi!B48)&CHAR(10)&\"Matière : \"&Lundi!$D48&CHAR(10)&\"Compétences : \"&Lundi!$G48))","v":""},{"$f":"IF(AND(Mardi!$D48=\"\",Mardi!$G48=\"\"),\"\",IF(Mardi!$D48=\"Récréation\",CONCATENATE(Mardi!$A48&\" / \"&Mardi!$B48)&CHAR(10)&\"RECREATION\",CONCATENATE(Mardi!$A48&\" / \"&Mardi!$B48)&CHAR(10)&\"Matière : \"&Mardi!$D48&CHAR(10)&\"Compétences : \"&Mardi!$G48))","v":""},{"$f":"IF(AND(Mercredi!$D48=\"\",Mercredi!$G48=\"\"),\"\",IF(Mercredi!$D48=\"Récréation\",CONCATENATE(Mercredi!$A48&\" / \"&Mercredi!$B48)&CHAR(10)&\"RECREATION\",CONCATENATE(Mercredi!$A48&\" / \"&Mercredi!$B48)&CHAR(10)&\"Matière : \"&Mercredi!$D48&CHAR(10)&\"Compétences : \"&Mercredi!$G48))","v":""},{"$f":"IF(AND(Jeudi!$D48=\"\",Jeudi!$G48=\"\"),\"\",IF(Jeudi!$D48=\"Récréation\",CONCATENATE(Jeudi!$A48&\" / \"&Jeudi!$B48)&CHAR(10)&\"RECREATION\",CONCATENATE(Jeudi!$A48&\" / \"&Jeudi!$B48)&CHAR(10)&\"Matière : \"&Jeudi!$D48&CHAR(10)&\"Compétences : \"&Jeudi!$G48))","v":""},{"$f":"IF(AND(Vendredi!$D48=\"\",Vendredi!$G48=\"\"),\"\",IF(Vendredi!$D48=\"Récréation\",CONCATENATE(Vendredi!$A48&\" / \"&Vendredi!$B48)&CHAR(10)&\"RECREATION\",CONCATENATE(Vendredi!$A48&\" / \"&Vendredi!$B48)&CHAR(10)&\"Matière : \"&Vendredi!$D48&CHAR(10)&\"Compétences : \"&Vendredi!$G48))","v":""}]
[{"$f":"IF(AND(Lundi!$D49=\"\",Lundi!$G49=\"\"),\"\",IF(Lundi!$D49=\"Récréation\",CONCATENATE(Lundi!A49&\" / \"&Lundi!B49)&CHAR(10)&\"RECREATION\",CONCATENATE(Lundi!A49&\" / \"&Lundi!B49)&CHAR(10)&\"Matière : \"&Lundi!$D49&CHAR(10)&\"Compétences : \"&Lundi!$G49))","v":""},{"$f":"IF(AND(Mardi!$D49=\"\",Mardi!$G49=\"\"),\"\",IF(Mardi!$D49=\"Récréation\",CONCATENATE(Mardi!$A49&\" / \"&Mardi!$B49)&CHAR(10)&\"RECREATION\",CONCATENATE(Mardi!$A49&\" / \"&Mardi!$B49)&CHAR(10)&\"Matière : \"&Mardi!$D49&CHAR(10)&\"Compétences : \"&Mardi!$G49))","v":""},{"$f":"IF(AND(Mercredi!$D49=\"\",Mercredi!$G49=\"\"),\"\",IF(Mercredi!$D49=\"Récréation\",CONCATENATE(Mercredi!$A49&\" / \"&Mercredi!$B49)&CHAR(10)&\"RECREATION\",CONCATENATE(Mercredi!$A49&\" / \"&Mercredi!$B49)&CHAR(10)&\"Matière : \"&Mercredi!$D49&CHAR(10)&\"Compétences : \"&Mercredi!$G49))","v":""},{"$f":"IF(AND(Jeudi!$D49=\"\",Jeudi!$G49=\"\"),\"\",IF(Jeudi!$D49=\"Récréation\",CONCATENATE(Jeudi!$A49&\" / \"&Jeudi!$B49)&CHAR(10)&\"RECREATION\",CONCATENATE(Jeudi!$A49&\" / \"&Jeudi!$B49)&CHAR(10)&\"Matière : \"&Jeudi!$D49&CHAR(10)&\"Compétences : \"&Jeudi!$G49))","v":""},{"$f":"IF(AND(Vendredi!$D49=\"\",Vendredi!$G49=\"\"),\"\",IF(Vendredi!$D49=\"Récréation\",CONCATENATE(Vendredi!$A49&\" / \"&Vendredi!$B49)&CHAR(10)&\"RECREATION\",CONCATENATE(Vendredi!$A49&\" / \"&Vendredi!$B49)&CHAR(10)&\"Matière : \"&Vendredi!$D49&CHAR(10)&\"Compétences : \"&Vendredi!$G49))","v":""}]
[{"$f":"IF(AND(Lundi!$D50=\"\",Lundi!$G50=\"\"),\"\",IF(Lundi!$D50=\"Récréation\",CONCATENATE(Lundi!A50&\" / \"&Lundi!B50)&CHAR(10)&\"RECREATION\",CONCATENATE(Lundi!A50&\" / \"&Lundi!B50)&CHAR(10)&\"Matière : \"&Lundi!$D50&CHAR(10)&\"Compétences : \"&Lundi!$G50))","v":""},{"$f":"IF(AND(Mardi!$D50=\"\",Mardi!$G50=\"\"),\"\",IF(Mardi!$D50=\"Récréation\",CONCATENATE(Mardi!$A50&\" / \"&Mardi!$B50)&CHAR(10)&\"RECREATION\",CONCATENATE(Mardi!$A50&\" / \"&Mardi!$B50)&CHAR(10)&\"Matière : \"&Mardi!$D50&CHAR(10)&\"Compétences : \"&Mardi!$G50))","v":""},{"$f":"IF(AND(Mercredi!$D50=\"\",Mercredi!$G50=\"\"),\"\",IF(Mercredi!$D50=\"Récréation\",CONCATENATE(Mercredi!$A50&\" / \"&Mercredi!$B50)&CHAR(10)&\"RECREATION\",CONCATENATE(Mercredi!$A50&\" / \"&Mercredi!$B50)&CHAR(10)&\"Matière : \"&Mercredi!$D50&CHAR(10)&\"Compétences : \"&Mercredi!$G50))","v":""},{"$f":"IF(AND(Jeudi!$D50=\"\",Jeudi!$G50=\"\"),\"\",IF(Jeudi!$D50=\"Récréation\",CONCATENATE(Jeudi!$A50&\" / \"&Jeudi!$B50)&CHAR(10)&\"RECREATION\",CONCATENATE(Jeudi!$A50&\" / \"&Jeudi!$B50)&CHAR(10)&\"Matière : \"&Jeudi!$D50&CHAR(10)&\"Compétences : \"&Jeudi!$G50))","v":""},{"$f":"IF(AND(Vendredi!$D50=\"\",Vendredi!$G50=\"\"),\"\",IF(Vendredi!$D50=\"Récréation\",CONCATENATE(Vendredi!$A50&\" / \"&Vendredi!$B50)&CHAR(10)&\"RECREATION\",CONCATENATE(Vendredi!$A50&\" / \"&Vendredi!$B50)&CHAR(10)&\"Matière : \"&Vendredi!$D50&CHAR(10)&\"Compétences : \"&Vendredi!$G50))","v":""}]
[{"$f":"IF(AND(Lundi!$D51=\"\",Lundi!$G51=\"\"),\"\",IF(Lundi!$D51=\"Récréation\",CONCATENATE(Lundi!A51&\" / \"&Lundi!B51)&CHAR(10)&\"RECREATION\",CONCATENATE(Lundi!A51&\" / \"&Lundi!B51)&CHAR(10)&\"Matière : \"&Lundi!$D51&CHAR(10)&\"Compétences : \"&Lundi!$G51))","v":""},{"$f":"IF(AND(Mardi!$D51=\"\",Mardi!$G51=\"\"),\"\",IF(Mardi!$D51=\"Récréation\",CONCATENATE(Mardi!$A51&\" / \"&Mardi!$B51)&CHAR(10)&\"RECREATION\",CONCATENATE(Mardi!$A51&\" / \"&Mardi!$B51)&CHAR(10)&\"Matière : \"&Mardi!$D51&CHAR(10)&\"Compétences : \"&Mardi!$G51))","v":""},{"$f":"IF(AND(Mercredi!$D51=\"\",Mercredi!$G51=\"\"),\"\",IF(Mercredi!$D51=\"Récréation\",CONCATENATE(Mercredi!$A51&\" / \"&Mercredi!$B51)&CHAR(10)&\"RECREATION\",CONCATENATE(Mercredi!$A51&\" / \"&Mercredi!$B51)&CHAR(10)&\"Matière : \"&Mercredi!$D51&CHAR(10)&\"Compétences : \"&Mercredi!$G51))","v":""},{"$f":"IF(AND(Jeudi!$D51=\"\",Jeudi!$G51=\"\"),\"\",IF(Jeudi!$D51=\"Récréation\",CONCATENATE(Jeudi!$A51&\" / \"&Jeudi!$B51)&CHAR(10)&\"RECREATION\",CONCATENATE(Jeudi!$A51&\" / \"&Jeudi!$B51)&CHAR(10)&\"Matière : \"&Jeudi!$D51&CHAR(10)&\"Compétences : \"&Jeudi!$G51))","v":""},{"$f":"IF(AND(Vendredi!$D51=\"\",Vendredi!$G51=\"\"),\"\",IF(Vendredi!$D51=\"Récréation\",CONCATENATE(Vendredi!$A51&\" / \"&Vendredi!$B51)&CHAR(10)&\"RECREATION\",CONCATENATE(Vendredi!$A51&\" / \"&Vendredi!$B51)&CHAR(10)&\"Matière : \"&Vendredi!$D51&CHAR(10)&\"Compétences : \"&Vendredi!$G51))","v":""}]
[{"$f":"IF(AND(Lundi!$D52=\"\",Lundi!$G52=\"\"),\"\",IF(Lundi!$D52=\"Récréation\",CONCATENATE(Lundi!A52&\" / \"&Lundi!B52)&CHAR(10)&\"RECREATION\",CONCATENATE(Lundi!A52&\" / \"&Lundi!B52)&CHAR(10)&\"Matière : \"&Lundi!$D52&CHAR(10)&\"Compétences : \"&Lundi!$G52))","v":""},{"$f":"IF(AND(Mardi!$D52=\"\",Mardi!$G52=\"\"),\"\",IF(Mardi!$D52=\"Récréation\",CONCATENATE(Mardi!$A52&\" / \"&Mardi!$B52)&CHAR(10)&\"RECREATION\",CONCATENATE(Mardi!$A52&\" / \"&Mardi!$B52)&CHAR(10)&\"Matière : \"&Mardi!$D52&CHAR(10)&\"Compétences : \"&Mardi!$G52))","v":""},{"$f":"IF(AND(Mercredi!$D52=\"\",Mercredi!$G52=\"\"),\"\",IF(Mercredi!$D52=\"Récréation\",CONCATENATE(Mercredi!$A52&\" / \"&Mercredi!$B52)&CHAR(10)&\"RECREATION\",CONCATENATE(Mercredi!$A52&\" / \"&Mercredi!$B52)&CHAR(10)&\"Matière : \"&Mercredi!$D52&CHAR(10)&\"Compétences : \"&Mercredi!$G52))","v":""},{"$f":"IF(AND(Jeudi!$D52=\"\",Jeudi!$G52=\"\"),\"\",IF(Jeudi!$D52=\"Récréation\",CONCATENATE(Jeudi!$A52&\" / \"&Jeudi!$B52)&CHAR(10)&\"RECREATION\",CONCATENATE(Jeudi!$A52&\" / \"&Jeudi!$B52)&CHAR(10)&\"Matière : \"&Jeudi!$D52&CHAR(10)&\"Compétences : \"&Jeudi!$G52))","v":""},{"$f":"IF(AND(Vendredi!$D52=\"\",Vendredi!$G52=\"\"),\"\",IF(Vendredi!$D52=\"Récréation\",CONCATENATE(Vendredi!$A52&\" / \"&Vendredi!$B52)&CHAR(10)&\"RECREATION\",CONCATENATE(Vendredi!$A52&\" / \"&Vendredi!$B52)&CHAR(10)&\"Matière : \"&Vendredi!$D52&CHAR(10)&\"Compétences : \"&Vendredi!$G52))","v":""}]
[{"$f":"IF(AND(Lundi!$D53=\"\",Lundi!$G53=\"\"),\"\",IF(Lundi!$D53=\"Récréation\",CONCATENATE(Lundi!A53&\" / \"&Lundi!B53)&CHAR(10)&\"RECREATION\",CONCATENATE(Lundi!A53&\" / \"&Lundi!B53)&CHAR(10)&\"Matière : \"&Lundi!$D53&CHAR(10)&\"Compétences : \"&Lundi!$G53))","v":""},{"$f":"IF(AND(Mardi!$D53=\"\",Mardi!$G53=\"\"),\"\",IF(Mardi!$D53=\"Récréation\",CONCATENATE(Mardi!$A53&\" / \"&Mardi!$B53)&CHAR(10)&\"RECREATION\",CONCATENATE(Mardi!$A53&\" / \"&Mardi!$B53)&CHAR(10)&\"Matière : \"&Mardi!$D53&CHAR(10)&\"Compétences : \"&Mardi!$G53))","v":""},{"$f":"IF(AND(Mercredi!$D53=\"\",Mercredi!$G53=\"\"),\"\",IF(Mercredi!$D53=\"Récréation\",CONCATENATE(Mercredi!$A53&\" / \"&Mercredi!$B53)&CHAR(10)&\"RECREATION\",CONCATENATE(Mercredi!$A53&\" / \"&Mercredi!$B53)&CHAR(10)&\"Matière : \"&Mercredi!$D53&CHAR(10)&\"Compétences : \"&Mercredi!$G53))","v":""},{"$f":"IF(AND(Jeudi!$D53=\"\",Jeudi!$G53=\"\"),\"\",IF(Jeudi!$D53=\"Récréation\",CONCATENATE(Jeudi!$A53&\" / \"&Jeudi!$B53)&CHAR(10)&\"RECREATION\",CONCATENATE(Jeudi!$A53&\" / \"&Jeudi!$B53)&CHAR(10)&\"Matière : \"&Jeudi!$D53&CHAR(10)&\"Compétences : \"&Jeudi!$G53))","v":""},{"$f":"IF(AND(Vendredi!$D53=\"\",Vendredi!$G53=\"\"),\"\",IF(Vendredi!$D53=\"Récréation\",CONCATENATE(Vendredi!$A53&\" / \"&Vendredi!$B53)&CHAR(10)&\"RECREATION\",CONCATENATE(Vendredi!$A53&\" / \"&Vendredi!$B53)&CHAR(10)&\"Matière : \"&Vendredi!$D53&CHAR(10)&\"Compétences : \"&Vendredi!$G53))","v":""}]
[{"$f":"IF(AND(Lundi!$D54=\"\",Lundi!$G54=\"\"),\"\",IF(Lundi!$D54=\"Récréation\",CONCATENATE(Lundi!A54&\" / \"&Lundi!B54)&CHAR(10)&\"RECREATION\",CONCATENATE(Lundi!A54&\" / \"&Lundi!B54)&CHAR(10)&\"Matière : \"&Lundi!$D54&CHAR(10)&\"Compétences : \"&Lundi!$G54))","v":""},{"$f":"IF(AND(Mardi!$D54=\"\",Mardi!$G54=\"\"),\"\",IF(Mardi!$D54=\"Récréation\",CONCATENATE(Mardi!$A54&\" / \"&Mardi!$B54)&CHAR(10)&\"RECREATION\",CONCATENATE(Mardi!$A54&\" / \"&Mardi!$B54)&CHAR(10)&\"Matière : \"&Mardi!$D54&CHAR(10)&\"Compétences : \"&Mardi!$G54))","v":""},{"$f":"IF(AND(Mercredi!$D54=\"\",Mercredi!$G54=\"\"),\"\",IF(Mercredi!$D54=\"Récréation\",CONCATENATE(Mercredi!$A54&\" / \"&Mercredi!$B54)&CHAR(10)&\"RECREATION\",CONCATENATE(Mercredi!$A54&\" / \"&Mercredi!$B54)&CHAR(10)&\"Matière : \"&Mercredi!$D54&CHAR(10)&\"Compétences : \"&Mercredi!$G54))","v":""},{"$f":"IF(AND(Jeudi!$D54=\"\",Jeudi!$G54=\"\"),\"\",IF(Jeudi!$D54=\"Récréation\",CONCATENATE(Jeudi!$A54&\" / \"&Jeudi!$B54)&CHAR(10)&\"RECREATION\",CONCATENATE(Jeudi!$A54&\" / \"&Jeudi!$B54)&CHAR(10)&\"Matière : \"&Jeudi!$D54&CHAR(10)&\"Compétences : \"&Jeudi!$G54))","v":""},{"$f":"IF(AND(Vendredi!$D54=\"\",Vendredi!$G54=\"\"),\"\",IF(Vendredi!$D54=\"Récréation\",CONCATENATE(Vendredi!$A54&\" / \"&Vendredi!$B54)&CHAR(10)&\"RECREATION\",CONCATENATE(Vendredi!$A54&\" / \"&Vendredi!$B54)&CHAR(10)&\"Matière : \"&Vendredi!$D54&CHAR(10)&\"Compétences : \"&Vendredi!$G54))","v":""}]
[{"$f":"IF(AND(Lundi!$D55=\"\",Lundi!$G55=\"\"),\"\",IF(Lundi!$D55=\"Récréation\",CONCATENATE(Lundi!A55&\" / \"&Lundi!B55)&CHAR(10)&\"RECREATION\",CONCATENATE(Lundi!A55&\" / \"&Lundi!B55)&CHAR(10)&\"Matière : \"&Lundi!$D55&CHAR(10)&\"Compétences : \"&Lundi!$G55))","v":""},{"$f":"IF(AND(Mardi!$D55=\"\",Mardi!$G55=\"\"),\"\",IF(Mardi!$D55=\"Récréation\",CONCATENATE(Mardi!$A55&\" / \"&Mardi!$B55)&CHAR(10)&\"RECREATION\",CONCATENATE(Mardi!$A55&\" / \"&Mardi!$B55)&CHAR(10)&\"Matière : \"&Mardi!$D55&CHAR(10)&\"Compétences : \"&Mardi!$G55))","v":""},{"$f":"IF(AND(Mercredi!$D55=\"\",Mercredi!$G55=\"\"),\"\",IF(Mercredi!$D55=\"Récréation\",CONCATENATE(Mercredi!$A55&\" / \"&Mercredi!$B55)&CHAR(10)&\"RECREATION\",CONCATENATE(Mercredi!$A55&\" / \"&Mercredi!$B55)&CHAR(10)&\"Matière : \"&Mercredi!$D55&CHAR(10)&\"Compétences : \"&Mercredi!$G55))","v":""},{"$f":"IF(AND(Jeudi!$D55=\"\",Jeudi!$G55=\"\"),\"\",IF(Jeudi!$D55=\"Récréation\",CONCATENATE(Jeudi!$A55&\" / \"&Jeudi!$B55)&CHAR(10)&\"RECREATION\",CONCATENATE(Jeudi!$A55&\" / \"&Jeudi!$B55)&CHAR(10)&\"Matière : \"&Jeudi!$D55&CHAR(10)&\"Compétences : \"&Jeudi!$G55))","v":""},{"$f":"IF(AND(Vendredi!$D55=\"\",Vendredi!$G55=\"\"),\"\",IF(Vendredi!$D55=\"Récréation\",CONCATENATE(Vendredi!$A55&\" / \"&Vendredi!$B55)&CHAR(10)&\"RECREATION\",CONCATENATE(Vendredi!$A55&\" / \"&Vendredi!$B55)&CHAR(10)&\"Matière : \"&Vendredi!$D55&CHAR(10)&\"Compétences : \"&Vendredi!$G55))","v":""}]
[{"$f":"IF(AND(Lundi!$D56=\"\",Lundi!$G56=\"\"),\"\",IF(Lundi!$D56=\"Récréation\",CONCATENATE(Lundi!A56&\" / \"&Lundi!B56)&CHAR(10)&\"RECREATION\",CONCATENATE(Lundi!A56&\" / \"&Lundi!B56)&CHAR(10)&\"Matière : \"&Lundi!$D56&CHAR(10)&\"Compétences : \"&Lundi!$G56))","v":""},{"$f":"IF(AND(Mardi!$D56=\"\",Mardi!$G56=\"\"),\"\",IF(Mardi!$D56=\"Récréation\",CONCATENATE(Mardi!$A56&\" / \"&Mardi!$B56)&CHAR(10)&\"RECREATION\",CONCATENATE(Mardi!$A56&\" / \"&Mardi!$B56)&CHAR(10)&\"Matière : \"&Mardi!$D56&CHAR(10)&\"Compétences : \"&Mardi!$G56))","v":""},{"$f":"IF(AND(Mercredi!$D56=\"\",Mercredi!$G56=\"\"),\"\",IF(Mercredi!$D56=\"Récréation\",CONCATENATE(Mercredi!$A56&\" / \"&Mercredi!$B56)&CHAR(10)&\"RECREATION\",CONCATENATE(Mercredi!$A56&\" / \"&Mercredi!$B56)&CHAR(10)&\"Matière : \"&Mercredi!$D56&CHAR(10)&\"Compétences : \"&Mercredi!$G56))","v":""},{"$f":"IF(AND(Jeudi!$D56=\"\",Jeudi!$G56=\"\"),\"\",IF(Jeudi!$D56=\"Récréation\",CONCATENATE(Jeudi!$A56&\" / \"&Jeudi!$B56)&CHAR(10)&\"RECREATION\",CONCATENATE(Jeudi!$A56&\" / \"&Jeudi!$B56)&CHAR(10)&\"Matière : \"&Jeudi!$D56&CHAR(10)&\"Compétences : \"&Jeudi!$G56))","v":""},{"$f":"IF(AND(Vendredi!$D56=\"\",Vendredi!$G56=\"\"),\"\",IF(Vendredi!$D56=\"Récréation\",CONCATENATE(Vendredi!$A56&\" / \"&Vendredi!$B56)&CHAR(10)&\"RECREATION\",CONCATENATE(Vendredi!$A56&\" / \"&Vendredi!$B56)&CHAR(10)&\"Matière : \"&Vendredi!$D56&CHAR(10)&\"Compétences : \"&Vendredi!$G56))","v":""}]
[{"$f":"IF(AND(Lundi!$D57=\"\",Lundi!$G57=\"\"),\"\",IF(Lundi!$D57=\"Récréation\",CONCATENATE(Lundi!A57&\" / \"&Lundi!B57)&CHAR(10)&\"RECREATION\",CONCATENATE(Lundi!A57&\" / \"&Lundi!B57)&CHAR(10)&\"Matière : \"&Lundi!$D57&CHAR(10)&\"Compétences : \"&Lundi!$G57))","v":""},{"$f":"IF(AND(Mardi!$D57=\"\",Mardi!$G57=\"\"),\"\",IF(Mardi!$D57=\"Récréation\",CONCATENATE(Mardi!$A57&\" / \"&Mardi!$B57)&CHAR(10)&\"RECREATION\",CONCATENATE(Mardi!$A57&\" / \"&Mardi!$B57)&CHAR(10)&\"Matière : \"&Mardi!$D57&CHAR(10)&\"Compétences : \"&Mardi!$G57))","v":""},{"$f":"IF(AND(Mercredi!$D57=\"\",Mercredi!$G57=\"\"),\"\",IF(Mercredi!$D57=\"Récréation\",CONCATENATE(Mercredi!$A57&\" / \"&Mercredi!$B57)&CHAR(10)&\"RECREATION\",CONCATENATE(Mercredi!$A57&\" / \"&Mercredi!$B57)&CHAR(10)&\"Matière : \"&Mercredi!$D57&CHAR(10)&\"Compétences : \"&Mercredi!$G57))","v":""},{"$f":"IF(AND(Jeudi!$D57=\"\",Jeudi!$G57=\"\"),\"\",IF(Jeudi!$D57=\"Récréation\",CONCATENATE(Jeudi!$A57&\" / \"&Jeudi!$B57)&CHAR(10)&\"RECREATION\",CONCATENATE(Jeudi!$A57&\" / \"&Jeudi!$B57)&CHAR(10)&\"Matière : \"&Jeudi!$D57&CHAR(10)&\"Compétences : \"&Jeudi!$G57))","v":""},{"$f":"IF(AND(Vendredi!$D57=\"\",Vendredi!$G57=\"\"),\"\",IF(Vendredi!$D57=\"Récréation\",CONCATENATE(Vendredi!$A57&\" / \"&Vendredi!$B57)&CHAR(10)&\"RECREATION\",CONCATENATE(Vendredi!$A57&\" / \"&Vendredi!$B57)&CHAR(10)&\"Matière : \"&Vendredi!$D57&CHAR(10)&\"Compétences : \"&Vendredi!$G57))","v":""}]
[{"$f":"IF(AND(Lundi!$D58=\"\",Lundi!$G58=\"\"),\"\",IF(Lundi!$D58=\"Récréation\",CONCATENATE(Lundi!A58&\" / \"&Lundi!B58)&CHAR(10)&\"RECREATION\",CONCATENATE(Lundi!A58&\" / \"&Lundi!B58)&CHAR(10)&\"Matière : \"&Lundi!$D58&CHAR(10)&\"Compétences : \"&Lundi!$G58))","v":""},{"$f":"IF(AND(Mardi!$D58=\"\",Mardi!$G58=\"\"),\"\",IF(Mardi!$D58=\"Récréation\",CONCATENATE(Mardi!$A58&\" / \"&Mardi!$B58)&CHAR(10)&\"RECREATION\",CONCATENATE(Mardi!$A58&\" / \"&Mardi!$B58)&CHAR(10)&\"Matière : \"&Mardi!$D58&CHAR(10)&\"Compétences : \"&Mardi!$G58))","v":""},{"$f":"IF(AND(Mercredi!$D58=\"\",Mercredi!$G58=\"\"),\"\",IF(Mercredi!$D58=\"Récréation\",CONCATENATE(Mercredi!$A58&\" / \"&Mercredi!$B58)&CHAR(10)&\"RECREATION\",CONCATENATE(Mercredi!$A58&\" / \"&Mercredi!$B58)&CHAR(10)&\"Matière : \"&Mercredi!$D58&CHAR(10)&\"Compétences : \"&Mercredi!$G58))","v":""},{"$f":"IF(AND(Jeudi!$D58=\"\",Jeudi!$G58=\"\"),\"\",IF(Jeudi!$D58=\"Récréation\",CONCATENATE(Jeudi!$A58&\" / \"&Jeudi!$B58)&CHAR(10)&\"RECREATION\",CONCATENATE(Jeudi!$A58&\" / \"&Jeudi!$B58)&CHAR(10)&\"Matière : \"&Jeudi!$D58&CHAR(10)&\"Compétences : \"&Jeudi!$G58))","v":""},{"$f":"IF(AND(Vendredi!$D58=\"\",Vendredi!$G58=\"\"),\"\",IF(Vendredi!$D58=\"Récréation\",CONCATENATE(Vendredi!$A58&\" / \"&Vendredi!$B58)&CHAR(10)&\"RECREATION\",CONCATENATE(Vendredi!$A58&\" / \"&Vendredi!$B58)&CHAR(10)&\"Matière : \"&Vendredi!$D58&CHAR(10)&\"Compétences : \"&Vendredi!$G58))","v":""}]
[{"$f":"IF(AND(Lundi!$D59=\"\",Lundi!$G59=\"\"),\"\",IF(Lundi!$D59=\"Récréation\",CONCATENATE(Lundi!A59&\" / \"&Lundi!B59)&CHAR(10)&\"RECREATION\",CONCATENATE(Lundi!A59&\" / \"&Lundi!B59)&CHAR(10)&\"Matière : \"&Lundi!$D59&CHAR(10)&\"Compétences : \"&Lundi!$G59))","v":""},{"$f":"IF(AND(Mardi!$D59=\"\",Mardi!$G59=\"\"),\"\",IF(Mardi!$D59=\"Récréation\",CONCATENATE(Mardi!$A59&\" / \"&Mardi!$B59)&CHAR(10)&\"RECREATION\",CONCATENATE(Mardi!$A59&\" / \"&Mardi!$B59)&CHAR(10)&\"Matière : \"&Mardi!$D59&CHAR(10)&\"Compétences : \"&Mardi!$G59))","v":""},{"$f":"IF(AND(Mercredi!$D59=\"\",Mercredi!$G59=\"\"),\"\",IF(Mercredi!$D59=\"Récréation\",CONCATENATE(Mercredi!$A59&\" / \"&Mercredi!$B59)&CHAR(10)&\"RECREATION\",CONCATENATE(Mercredi!$A59&\" / \"&Mercredi!$B59)&CHAR(10)&\"Matière : \"&Mercredi!$D59&CHAR(10)&\"Compétences : \"&Mercredi!$G59))","v":""},{"$f":"IF(AND(Jeudi!$D59=\"\",Jeudi!$G59=\"\"),\"\",IF(Jeudi!$D59=\"Récréation\",CONCATENATE(Jeudi!$A59&\" / \"&Jeudi!$B59)&CHAR(10)&\"RECREATION\",CONCATENATE(Jeudi!$A59&\" / \"&Jeudi!$B59)&CHAR(10)&\"Matière : \"&Jeudi!$D59&CHAR(10)&\"Compétences : \"&Jeudi!$G59))","v":""},{"$f":"IF(AND(Vendredi!$D59=\"\",Vendredi!$G59=\"\"),\"\",IF(Vendredi!$D59=\"Récréation\",CONCATENATE(Vendredi!$A59&\" / \"&Vendredi!$B59)&CHAR(10)&\"RECREATION\",CONCATENATE(Vendredi!$A59&\" / \"&Vendredi!$B59)&CHAR(10)&\"Matière : \"&Vendredi!$D59&CHAR(10)&\"Compétences : \"&Vendredi!$G59))","v":""}]
[{"$f":"IF(AND(Lundi!$D60=\"\",Lundi!$G60=\"\"),\"\",IF(Lundi!$D60=\"Récréation\",CONCATENATE(Lundi!A60&\" / \"&Lundi!B60)&CHAR(10)&\"RECREATION\",CONCATENATE(Lundi!A60&\" / \"&Lundi!B60)&CHAR(10)&\"Matière : \"&Lundi!$D60&CHAR(10)&\"Compétences : \"&Lundi!$G60))","v":""},{"$f":"IF(AND(Mardi!$D60=\"\",Mardi!$G60=\"\"),\"\",IF(Mardi!$D60=\"Récréation\",CONCATENATE(Mardi!$A60&\" / \"&Mardi!$B60)&CHAR(10)&\"RECREATION\",CONCATENATE(Mardi!$A60&\" / \"&Mardi!$B60)&CHAR(10)&\"Matière : \"&Mardi!$D60&CHAR(10)&\"Compétences : \"&Mardi!$G60))","v":""},{"$f":"IF(AND(Mercredi!$D60=\"\",Mercredi!$G60=\"\"),\"\",IF(Mercredi!$D60=\"Récréation\",CONCATENATE(Mercredi!$A60&\" / \"&Mercredi!$B60)&CHAR(10)&\"RECREATION\",CONCATENATE(Mercredi!$A60&\" / \"&Mercredi!$B60)&CHAR(10)&\"Matière : \"&Mercredi!$D60&CHAR(10)&\"Compétences : \"&Mercredi!$G60))","v":""},{"$f":"IF(AND(Jeudi!$D60=\"\",Jeudi!$G60=\"\"),\"\",IF(Jeudi!$D60=\"Récréation\",CONCATENATE(Jeudi!$A60&\" / \"&Jeudi!$B60)&CHAR(10)&\"RECREATION\",CONCATENATE(Jeudi!$A60&\" / \"&Jeudi!$B60)&CHAR(10)&\"Matière : \"&Jeudi!$D60&CHAR(10)&\"Compétences : \"&Jeudi!$G60))","v":""},{"$f":"IF(AND(Vendredi!$D60=\"\",Vendredi!$G60=\"\"),\"\",IF(Vendredi!$D60=\"Récréation\",CONCATENATE(Vendredi!$A60&\" / \"&Vendredi!$B60)&CHAR(10)&\"RECREATION\",CONCATENATE(Vendredi!$A60&\" / \"&Vendredi!$B60)&CHAR(10)&\"Matière : \"&Vendredi!$D60&CHAR(10)&\"Compétences : \"&Vendredi!$G60))","v":""}]
[{"$f":"IF(AND(Lundi!$D61=\"\",Lundi!$G61=\"\"),\"\",IF(Lundi!$D61=\"Récréation\",CONCATENATE(Lundi!A61&\" / \"&Lundi!B61)&CHAR(10)&\"RECREATION\",CONCATENATE(Lundi!A61&\" / \"&Lundi!B61)&CHAR(10)&\"Matière : \"&Lundi!$D61&CHAR(10)&\"Compétences : \"&Lundi!$G61))","v":""},{"$f":"IF(AND(Mardi!$D61=\"\",Mardi!$G61=\"\"),\"\",IF(Mardi!$D61=\"Récréation\",CONCATENATE(Mardi!$A61&\" / \"&Mardi!$B61)&CHAR(10)&\"RECREATION\",CONCATENATE(Mardi!$A61&\" / \"&Mardi!$B61)&CHAR(10)&\"Matière : \"&Mardi!$D61&CHAR(10)&\"Compétences : \"&Mardi!$G61))","v":""},{"$f":"IF(AND(Mercredi!$D61=\"\",Mercredi!$G61=\"\"),\"\",IF(Mercredi!$D61=\"Récréation\",CONCATENATE(Mercredi!$A61&\" / \"&Mercredi!$B61)&CHAR(10)&\"RECREATION\",CONCATENATE(Mercredi!$A61&\" / \"&Mercredi!$B61)&CHAR(10)&\"Matière : \"&Mercredi!$D61&CHAR(10)&\"Compétences : \"&Mercredi!$G61))","v":""},{"$f":"IF(AND(Jeudi!$D61=\"\",Jeudi!$G61=\"\"),\"\",IF(Jeudi!$D61=\"Récréation\",CONCATENATE(Jeudi!$A61&\" / \"&Jeudi!$B61)&CHAR(10)&\"RECREATION\",CONCATENATE(Jeudi!$A61&\" / \"&Jeudi!$B61)&CHAR(10)&\"Matière : \"&Jeudi!$D61&CHAR(10)&\"Compétences : \"&Jeudi!$G61))","v":""},{"$f":"IF(AND(Vendredi!$D61=\"\",Vendredi!$G61=\"\"),\"\",IF(Vendredi!$D61=\"Récréation\",CONCATENATE(Vendredi!$A61&\" / \"&Vendredi!$B61)&CHAR(10)&\"RECREATION\",CONCATENATE(Vendredi!$A61&\" / \"&Vendredi!$B61)&CHAR(10)&\"Matière : \"&Vendredi!$D61&CHAR(10)&\"Compétences : \"&Vendredi!$G61))","v":""}]
[{"$f":"IF(AND(Lundi!$D62=\"\",Lundi!$G62=\"\"),\"\",IF(Lundi!$D62=\"Récréation\",CONCATENATE(Lundi!A62&\" / \"&Lundi!B62)&CHAR(10)&\"RECREATION\",CONCATENATE(Lundi!A62&\" / \"&Lundi!B62)&CHAR(10)&\"Matière : \"&Lundi!$D62&CHAR(10)&\"Compétences : \"&Lundi!$G62))","v":""},{"$f":"IF(AND(Mardi!$D62=\"\",Mardi!$G62=\"\"),\"\",IF(Mardi!$D62=\"Récréation\",CONCATENATE(Mardi!$A62&\" / \"&Mardi!$B62)&CHAR(10)&\"RECREATION\",CONCATENATE(Mardi!$A62&\" / \"&Mardi!$B62)&CHAR(10)&\"Matière : \"&Mardi!$D62&CHAR(10)&\"Compétences : \"&Mardi!$G62))","v":""},{"$f":"IF(AND(Mercredi!$D62=\"\",Mercredi!$G62=\"\"),\"\",IF(Mercredi!$D62=\"Récréation\",CONCATENATE(Mercredi!$A62&\" / \"&Mercredi!$B62)&CHAR(10)&\"RECREATION\",CONCATENATE(Mercredi!$A62&\" / \"&Mercredi!$B62)&CHAR(10)&\"Matière : \"&Mercredi!$D62&CHAR(10)&\"Compétences : \"&Mercredi!$G62))","v":""},{"$f":"IF(AND(Jeudi!$D62=\"\",Jeudi!$G62=\"\"),\"\",IF(Jeudi!$D62=\"Récréation\",CONCATENATE(Jeudi!$A62&\" / \"&Jeudi!$B62)&CHAR(10)&\"RECREATION\",CONCATENATE(Jeudi!$A62&\" / \"&Jeudi!$B62)&CHAR(10)&\"Matière : \"&Jeudi!$D62&CHAR(10)&\"Compétences : \"&Jeudi!$G62))","v":""},{"$f":"IF(AND(Vendredi!$D62=\"\",Vendredi!$G62=\"\"),\"\",IF(Vendredi!$D62=\"Récréation\",CONCATENATE(Vendredi!$A62&\" / \"&Vendredi!$B62)&CHAR(10)&\"RECREATION\",CONCATENATE(Vendredi!$A62&\" / \"&Vendredi!$B62)&CHAR(10)&\"Matière : \"&Vendredi!$D62&CHAR(10)&\"Compétences : \"&Vendredi!$G62))","v":""}]
[{"$f":"IF(AND(Lundi!$D63=\"\",Lundi!$G63=\"\"),\"\",IF(Lundi!$D63=\"Récréation\",CONCATENATE(Lundi!A63&\" / \"&Lundi!B63)&CHAR(10)&\"RECREATION\",CONCATENATE(Lundi!A63&\" / \"&Lundi!B63)&CHAR(10)&\"Matière : \"&Lundi!$D63&CHAR(10)&\"Compétences : \"&Lundi!$G63))","v":""},{"$f":"IF(AND(Mardi!$D63=\"\",Mardi!$G63=\"\"),\"\",IF(Mardi!$D63=\"Récréation\",CONCATENATE(Mardi!$A63&\" / \"&Mardi!$B63)&CHAR(10)&\"RECREATION\",CONCATENATE(Mardi!$A63&\" / \"&Mardi!$B63)&CHAR(10)&\"Matière : \"&Mardi!$D63&CHAR(10)&\"Compétences : \"&Mardi!$G63))","v":""},{"$f":"IF(AND(Mercredi!$D63=\"\",Mercredi!$G63=\"\"),\"\",IF(Mercredi!$D63=\"Récréation\",CONCATENATE(Mercredi!$A63&\" / \"&Mercredi!$B63)&CHAR(10)&\"RECREATION\",CONCATENATE(Mercredi!$A63&\" / \"&Mercredi!$B63)&CHAR(10)&\"Matière : \"&Mercredi!$D63&CHAR(10)&\"Compétences : \"&Mercredi!$G63))","v":""},{"$f":"IF(AND(Jeudi!$D63=\"\",Jeudi!$G63=\"\"),\"\",IF(Jeudi!$D63=\"Récréation\",CONCATENATE(Jeudi!$A63&\" / \"&Jeudi!$B63)&CHAR(10)&\"RECREATION\",CONCATENATE(Jeudi!$A63&\" / \"&Jeudi!$B63)&CHAR(10)&\"Matière : \"&Jeudi!$D63&CHAR(10)&\"Compétences : \"&Jeudi!$G63))","v":""},{"$f":"IF(AND(Vendredi!$D63=\"\",Vendredi!$G63=\"\"),\"\",IF(Vendredi!$D63=\"Récréation\",CONCATENATE(Vendredi!$A63&\" / \"&Vendredi!$B63)&CHAR(10)&\"RECREATION\",CONCATENATE(Vendredi!$A63&\" / \"&Vendredi!$B63)&CHAR(10)&\"Matière : \"&Vendredi!$D63&CHAR(10)&\"Compétences : \"&Vendredi!$G63))","v":""}]
[{"$f":"IF(AND(Lundi!$D64=\"\",Lundi!$G64=\"\"),\"\",IF(Lundi!$D64=\"Récréation\",CONCATENATE(Lundi!A64&\" / \"&Lundi!B64)&CHAR(10)&\"RECREATION\",CONCATENATE(Lundi!A64&\" / \"&Lundi!B64)&CHAR(10)&\"Matière : \"&Lundi!$D64&CHAR(10)&\"Compétences : \"&Lundi!$G64))","v":""},{"$f":"IF(AND(Mardi!$D64=\"\",Mardi!$G64=\"\"),\"\",IF(Mardi!$D64=\"Récréation\",CONCATENATE(Mardi!$A64&\" / \"&Mardi!$B64)&CHAR(10)&\"RECREATION\",CONCATENATE(Mardi!$A64&\" / \"&Mardi!$B64)&CHAR(10)&\"Matière : \"&Mardi!$D64&CHAR(10)&\"Compétences : \"&Mardi!$G64))","v":""},{"$f":"IF(AND(Mercredi!$D64=\"\",Mercredi!$G64=\"\"),\"\",IF(Mercredi!$D64=\"Récréation\",CONCATENATE(Mercredi!$A64&\" / \"&Mercredi!$B64)&CHAR(10)&\"RECREATION\",CONCATENATE(Mercredi!$A64&\" / \"&Mercredi!$B64)&CHAR(10)&\"Matière : \"&Mercredi!$D64&CHAR(10)&\"Compétences : \"&Mercredi!$G64))","v":""},{"$f":"IF(AND(Jeudi!$D64=\"\",Jeudi!$G64=\"\"),\"\",IF(Jeudi!$D64=\"Récréation\",CONCATENATE(Jeudi!$A64&\" / \"&Jeudi!$B64)&CHAR(10)&\"RECREATION\",CONCATENATE(Jeudi!$A64&\" / \"&Jeudi!$B64)&CHAR(10)&\"Matière : \"&Jeudi!$D64&CHAR(10)&\"Compétences : \"&Jeudi!$G64))","v":""},{"$f":"IF(AND(Vendredi!$D64=\"\",Vendredi!$G64=\"\"),\"\",IF(Vendredi!$D64=\"Récréation\",CONCATENATE(Vendredi!$A64&\" / \"&Vendredi!$B64)&CHAR(10)&\"RECREATION\",CONCATENATE(Vendredi!$A64&\" / \"&Vendredi!$B64)&CHAR(10)&\"Matière : \"&Vendredi!$D64&CHAR(10)&\"Compétences : \"&Vendredi!$G64))","v":""}]
[{"$f":"IF(AND(Lundi!$D65=\"\",Lundi!$G65=\"\"),\"\",IF(Lundi!$D65=\"Récréation\",CONCATENATE(Lundi!A65&\" / \"&Lundi!B65)&CHAR(10)&\"RECREATION\",CONCATENATE(Lundi!A65&\" / \"&Lundi!B65)&CHAR(10)&\"Matière : \"&Lundi!$D65&CHAR(10)&\"Compétences : \"&Lundi!$G65))","v":""},{"$f":"IF(AND(Mardi!$D65=\"\",Mardi!$G65=\"\"),\"\",IF(Mardi!$D65=\"Récréation\",CONCATENATE(Mardi!$A65&\" / \"&Mardi!$B65)&CHAR(10)&\"RECREATION\",CONCATENATE(Mardi!$A65&\" / \"&Mardi!$B65)&CHAR(10)&\"Matière : \"&Mardi!$D65&CHAR(10)&\"Compétences : \"&Mardi!$G65))","v":""},{"$f":"IF(AND(Mercredi!$D65=\"\",Mercredi!$G65=\"\"),\"\",IF(Mercredi!$D65=\"Récréation\",CONCATENATE(Mercredi!$A65&\" / \"&Mercredi!$B65)&CHAR(10)&\"RECREATION\",CONCATENATE(Mercredi!$A65&\" / \"&Mercredi!$B65)&CHAR(10)&\"Matière : \"&Mercredi!$D65&CHAR(10)&\"Compétences : \"&Mercredi!$G65))","v":""},{"$f":"IF(AND(Jeudi!$D65=\"\",Jeudi!$G65=\"\"),\"\",IF(Jeudi!$D65=\"Récréation\",CONCATENATE(Jeudi!$A65&\" / \"&Jeudi!$B65)&CHAR(10)&\"RECREATION\",CONCATENATE(Jeudi!$A65&\" / \"&Jeudi!$B65)&CHAR(10)&\"Matière : \"&Jeudi!$D65&CHAR(10)&\"Compétences : \"&Jeudi!$G65))","v":""},{"$f":"IF(AND(Vendredi!$D65=\"\",Vendredi!$G65=\"\"),\"\",IF(Vendredi!$D65=\"Récréation\",CONCATENATE(Vendredi!$A65&\" / \"&Vendredi!$B65)&CHAR(10)&\"RECREATION\",CONCATENATE(Vendredi!$A65&\" / \"&Vendredi!$B65)&CHAR(10)&\"Matière : \"&Vendredi!$D65&CHAR(10)&\"Compétences : \"&Vendredi!$G65))","v":""}]
[{"$f":"IF(AND(Lundi!$D66=\"\",Lundi!$G66=\"\"),\"\",IF(Lundi!$D66=\"Récréation\",CONCATENATE(Lundi!A66&\" / \"&Lundi!B66)&CHAR(10)&\"RECREATION\",CONCATENATE(Lundi!A66&\" / \"&Lundi!B66)&CHAR(10)&\"Matière : \"&Lundi!$D66&CHAR(10)&\"Compétences : \"&Lundi!$G66))","v":""},{"$f":"IF(AND(Mardi!$D66=\"\",Mardi!$G66=\"\"),\"\",IF(Mardi!$D66=\"Récréation\",CONCATENATE(Mardi!$A66&\" / \"&Mardi!$B66)&CHAR(10)&\"RECREATION\",CONCATENATE(Mardi!$A66&\" / \"&Mardi!$B66)&CHAR(10)&\"Matière : \"&Mardi!$D66&CHAR(10)&\"Compétences : \"&Mardi!$G66))","v":""},{"$f":"IF(AND(Mercredi!$D66=\"\",Mercredi!$G66=\"\"),\"\",IF(Mercredi!$D66=\"Récréation\",CONCATENATE(Mercredi!$A66&\" / \"&Mercredi!$B66)&CHAR(10)&\"RECREATION\",CONCATENATE(Mercredi!$A66&\" / \"&Mercredi!$B66)&CHAR(10)&\"Matière : \"&Mercredi!$D66&CHAR(10)&\"Compétences : \"&Mercredi!$G66))","v":""},{"$f":"IF(AND(Jeudi!$D66=\"\",Jeudi!$G66=\"\"),\"\",IF(Jeudi!$D66=\"Récréation\",CONCATENATE(Jeudi!$A66&\" / \"&Jeudi!$B66)&CHAR(10)&\"RECREATION\",CONCATENATE(Jeudi!$A66&\" / \"&Jeudi!$B66)&CHAR(10)&\"Matière : \"&Jeudi!$D66&CHAR(10)&\"Compétences : \"&Jeudi!$G66))","v":""},{"$f":"IF(AND(Vendredi!$D66=\"\",Vendredi!$G66=\"\"),\"\",IF(Vendredi!$D66=\"Récréation\",CONCATENATE(Vendredi!$A66&\" / \"&Vendredi!$B66)&CHAR(10)&\"RECREATION\",CONCATENATE(Vendredi!$A66&\" / \"&Vendredi!$B66)&CHAR(10)&\"Matière : \"&Vendredi!$D66&CHAR(10)&\"Compétences : \"&Vendredi!$G66))","v":""}]
[{"$f":"IF(AND(Lundi!$D67=\"\",Lundi!$G67=\"\"),\"\",IF(Lundi!$D67=\"Récréation\",CONCATENATE(Lundi!A67&\" / \"&Lundi!B67)&CHAR(10)&\"RECREATION\",CONCATENATE(Lundi!A67&\" / \"&Lundi!B67)&CHAR(10)&\"Matière : \"&Lundi!$D67&CHAR(10)&\"Compétences : \"&Lundi!$G67))","v":""},{"$f":"IF(AND(Mardi!$D67=\"\",Mardi!$G67=\"\"),\"\",IF(Mardi!$D67=\"Récréation\",CONCATENATE(Mardi!$A67&\" / \"&Mardi!$B67)&CHAR(10)&\"RECREATION\",CONCATENATE(Mardi!$A67&\" / \"&Mardi!$B67)&CHAR(10)&\"Matière : \"&Mardi!$D67&CHAR(10)&\"Compétences : \"&Mardi!$G67))","v":""},{"$f":"IF(AND(Mercredi!$D67=\"\",Mercredi!$G67=\"\"),\"\",IF(Mercredi!$D67=\"Récréation\",CONCATENATE(Mercredi!$A67&\" / \"&Mercredi!$B67)&CHAR(10)&\"RECREATION\",CONCATENATE(Mercredi!$A67&\" / \"&Mercredi!$B67)&CHAR(10)&\"Matière : \"&Mercredi!$D67&CHAR(10)&\"Compétences : \"&Mercredi!$G67))","v":""},{"$f":"IF(AND(Jeudi!$D67=\"\",Jeudi!$G67=\"\"),\"\",IF(Jeudi!$D67=\"Récréation\",CONCATENATE(Jeudi!$A67&\" / \"&Jeudi!$B67)&CHAR(10)&\"RECREATION\",CONCATENATE(Jeudi!$A67&\" / \"&Jeudi!$B67)&CHAR(10)&\"Matière : \"&Jeudi!$D67&CHAR(10)&\"Compétences : \"&Jeudi!$G67))","v":""},{"$f":"IF(AND(Vendredi!$D67=\"\",Vendredi!$G67=\"\"),\"\",IF(Vendredi!$D67=\"Récréation\",CONCATENATE(Vendredi!$A67&\" / \"&Vendredi!$B67)&CHAR(10)&\"RECREATION\",CONCATENATE(Vendredi!$A67&\" / \"&Vendredi!$B67)&CHAR(10)&\"Matière : \"&Vendredi!$D67&CHAR(10)&\"Compétences : \"&Vendredi!$G67))","v":""}]
[{"$f":"IF(AND(Lundi!$D68=\"\",Lundi!$G68=\"\"),\"\",IF(Lundi!$D68=\"Récréation\",CONCATENATE(Lundi!A68&\" / \"&Lundi!B68)&CHAR(10)&\"RECREATION\",CONCATENATE(Lundi!A68&\" / \"&Lundi!B68)&CHAR(10)&\"Matière : \"&Lundi!$D68&CHAR(10)&\"Compétences : \"&Lundi!$G68))","v":""},{"$f":"IF(AND(Mardi!$D68=\"\",Mardi!$G68=\"\"),\"\",IF(Mardi!$D68=\"Récréation\",CONCATENATE(Mardi!$A68&\" / \"&Mardi!$B68)&CHAR(10)&\"RECREATION\",CONCATENATE(Mardi!$A68&\" / \"&Mardi!$B68)&CHAR(10)&\"Matière : \"&Mardi!$D68&CHAR(10)&\"Compétences : \"&Mardi!$G68))","v":""},{"$f":"IF(AND(Mercredi!$D68=\"\",Mercredi!$G68=\"\"),\"\",IF(Mercredi!$D68=\"Récréation\",CONCATENATE(Mercredi!$A68&\" / \"&Mercredi!$B68)&CHAR(10)&\"RECREATION\",CONCATENATE(Mercredi!$A68&\" / \"&Mercredi!$B68)&CHAR(10)&\"Matière : \"&Mercredi!$D68&CHAR(10)&\"Compétences : \"&Mercredi!$G68))","v":""},{"$f":"IF(AND(Jeudi!$D68=\"\",Jeudi!$G68=\"\"),\"\",IF(Jeudi!$D68=\"Récréation\",CONCATENATE(Jeudi!$A68&\" / \"&Jeudi!$B68)&CHAR(10)&\"RECREATION\",CONCATENATE(Jeudi!$A68&\" / \"&Jeudi!$B68)&CHAR(10)&\"Matière : \"&Jeudi!$D68&CHAR(10)&\"Compétences : \"&Jeudi!$G68))","v":""},{"$f":"IF(AND(Vendredi!$D68=\"\",Vendredi!$G68=\"\"),\"\",IF(Vendredi!$D68=\"Récréation\",CONCATENATE(Vendredi!$A68&\" / \"&Vendredi!$B68)&CHAR(10)&\"RECREATION\",CONCATENATE(Vendredi!$A68&\" / \"&Vendredi!$B68)&CHAR(10)&\"Matière : \"&Vendredi!$D68&CHAR(10)&\"Compétences : \"&Vendredi!$G68))","v":""}]
[{"$f":"IF(AND(Lundi!$D69=\"\",Lundi!$G69=\"\"),\"\",IF(Lundi!$D69=\"Récréation\",CONCATENATE(Lundi!A69&\" / \"&Lundi!B69)&CHAR(10)&\"RECREATION\",CONCATENATE(Lundi!A69&\" / \"&Lundi!B69)&CHAR(10)&\"Matière : \"&Lundi!$D69&CHAR(10)&\"Compétences : \"&Lundi!$G69))","v":""},{"$f":"IF(AND(Mardi!$D69=\"\",Mardi!$G69=\"\"),\"\",IF(Mardi!$D69=\"Récréation\",CONCATENATE(Mardi!$A69&\" / \"&Mardi!$B69)&CHAR(10)&\"RECREATION\",CONCATENATE(Mardi!$A69&\" / \"&Mardi!$B69)&CHAR(10)&\"Matière : \"&Mardi!$D69&CHAR(10)&\"Compétences : \"&Mardi!$G69))","v":""},{"$f":"IF(AND(Mercredi!$D69=\"\",Mercredi!$G69=\"\"),\"\",IF(Mercredi!$D69=\"Récréation\",CONCATENATE(Mercredi!$A69&\" / \"&Mercredi!$B69)&CHAR(10)&\"RECREATION\",CONCATENATE(Mercredi!$A69&\" / \"&Mercredi!$B69)&CHAR(10)&\"Matière : \"&Mercredi!$D69&CHAR(10)&\"Compétences : \"&Mercredi!$G69))","v":""},{"$f":"IF(AND(Jeudi!$D69=\"\",Jeudi!$G69=\"\"),\"\",IF(Jeudi!$D69=\"Récréation\",CONCATENATE(Jeudi!$A69&\" / \"&Jeudi!$B69)&CHAR(10)&\"RECREATION\",CONCATENATE(Jeudi!$A69&\" / \"&Jeudi!$B69)&CHAR(10)&\"Matière : \"&Jeudi!$D69&CHAR(10)&\"Compétences : \"&Jeudi!$G69))","v":""},{"$f":"IF(AND(Vendredi!$D69=\"\",Vendredi!$G69=\"\"),\"\",IF(Vendredi!$D69=\"Récréation\",CONCATENATE(Vendredi!$A69&\" / \"&Vendredi!$B69)&CHAR(10)&\"RECREATION\",CONCATENATE(Vendredi!$A69&\" / \"&Vendredi!$B69)&CHAR(10)&\"Matière : \"&Vendredi!$D69&CHAR(10)&\"Compétences : \"&Vendredi!$G69))","v":""}]
[{"$f":"IF(AND(Lundi!$D70=\"\",Lundi!$G70=\"\"),\"\",IF(Lundi!$D70=\"Récréation\",CONCATENATE(Lundi!A70&\" / \"&Lundi!B70)&CHAR(10)&\"RECREATION\",CONCATENATE(Lundi!A70&\" / \"&Lundi!B70)&CHAR(10)&\"Matière : \"&Lundi!$D70&CHAR(10)&\"Compétences : \"&Lundi!$G70))","v":""},{"$f":"IF(AND(Mardi!$D70=\"\",Mardi!$G70=\"\"),\"\",IF(Mardi!$D70=\"Récréation\",CONCATENATE(Mardi!$A70&\" / \"&Mardi!$B70)&CHAR(10)&\"RECREATION\",CONCATENATE(Mardi!$A70&\" / \"&Mardi!$B70)&CHAR(10)&\"Matière : \"&Mardi!$D70&CHAR(10)&\"Compétences : \"&Mardi!$G70))","v":""},{"$f":"IF(AND(Mercredi!$D70=\"\",Mercredi!$G70=\"\"),\"\",IF(Mercredi!$D70=\"Récréation\",CONCATENATE(Mercredi!$A70&\" / \"&Mercredi!$B70)&CHAR(10)&\"RECREATION\",CONCATENATE(Mercredi!$A70&\" / \"&Mercredi!$B70)&CHAR(10)&\"Matière : \"&Mercredi!$D70&CHAR(10)&\"Compétences : \"&Mercredi!$G70))","v":""},{"$f":"IF(AND(Jeudi!$D70=\"\",Jeudi!$G70=\"\"),\"\",IF(Jeudi!$D70=\"Récréation\",CONCATENATE(Jeudi!$A70&\" / \"&Jeudi!$B70)&CHAR(10)&\"RECREATION\",CONCATENATE(Jeudi!$A70&\" / \"&Jeudi!$B70)&CHAR(10)&\"Matière : \"&Jeudi!$D70&CHAR(10)&\"Compétences : \"&Jeudi!$G70))","v":""},{"$f":"IF(AND(Vendredi!$D70=\"\",Vendredi!$G70=\"\"),\"\",IF(Vendredi!$D70=\"Récréation\",CONCATENATE(Vendredi!$A70&\" / \"&Vendredi!$B70)&CHAR(10)&\"RECREATION\",CONCATENATE(Vendredi!$A70&\" / \"&Vendredi!$B70)&CHAR(10)&\"Matière : \"&Vendredi!$D70&CHAR(10)&\"Compétences : \"&Vendredi!$G70))","v":""}]
[{"$f":"IF(AND(Lundi!$D71=\"\",Lundi!$G71=\"\"),\"\",IF(Lundi!$D71=\"Récréation\",CONCATENATE(Lundi!A71&\" / \"&Lundi!B71)&CHAR(10)&\"RECREATION\",CONCATENATE(Lundi!A71&\" / \"&Lundi!B71)&CHAR(10)&\"Matière : \"&Lundi!$D71&CHAR(10)&\"Compétences : \"&Lundi!$G71))","v":""},{"$f":"IF(AND(Mardi!$D71=\"\",Mardi!$G71=\"\"),\"\",IF(Mardi!$D71=\"Récréation\",CONCATENATE(Mardi!$A71&\" / \"&Mardi!$B71)&CHAR(10)&\"RECREATION\",CONCATENATE(Mardi!$A71&\" / \"&Mardi!$B71)&CHAR(10)&\"Matière : \"&Mardi!$D71&CHAR(10)&\"Compétences : \"&Mardi!$G71))","v":""},{"$f":"IF(AND(Mercredi!$D71=\"\",Mercredi!$G71=\"\"),\"\",IF(Mercredi!$D71=\"Récréation\",CONCATENATE(Mercredi!$A71&\" / \"&Mercredi!$B71)&CHAR(10)&\"RECREATION\",CONCATENATE(Mercredi!$A71&\" / \"&Mercredi!$B71)&CHAR(10)&\"Matière : \"&Mercredi!$D71&CHAR(10)&\"Compétences : \"&Mercredi!$G71))","v":""},{"$f":"IF(AND(Jeudi!$D71=\"\",Jeudi!$G71=\"\"),\"\",IF(Jeudi!$D71=\"Récréation\",CONCATENATE(Jeudi!$A71&\" / \"&Jeudi!$B71)&CHAR(10)&\"RECREATION\",CONCATENATE(Jeudi!$A71&\" / \"&Jeudi!$B71)&CHAR(10)&\"Matière : \"&Jeudi!$D71&CHAR(10)&\"Compétences : \"&Jeudi!$G71))","v":""},{"$f":"IF(AND(Vendredi!$D71=\"\",Vendredi!$G71=\"\"),\"\",IF(Vendredi!$D71=\"Récréation\",CONCATENATE(Vendredi!$A71&\" / \"&Vendredi!$B71)&CHAR(10)&\"RECREATION\",CONCATENATE(Vendredi!$A71&\" / \"&Vendredi!$B71)&CHAR(10)&\"Matière : \"&Vendredi!$D71&CHAR(10)&\"Compétences : \"&Vendredi!$G71))","v":""}]
[{"$f":"IF(AND(Lundi!$D72=\"\",Lundi!$G72=\"\"),\"\",IF(Lundi!$D72=\"Récréation\",CONCATENATE(Lundi!A72&\" / \"&Lundi!B72)&CHAR(10)&\"RECREATION\",CONCATENATE(Lundi!A72&\" / \"&Lundi!B72)&CHAR(10)&\"Matière : \"&Lundi!$D72&CHAR(10)&\"Compétences : \"&Lundi!$G72))","v":""},{"$f":"IF(AND(Mardi!$D72=\"\",Mardi!$G72=\"\"),\"\",IF(Mardi!$D72=\"Récréation\",CONCATENATE(Mardi!$A72&\" / \"&Mardi!$B72)&CHAR(10)&\"RECREATION\",CONCATENATE(Mardi!$A72&\" / \"&Mardi!$B72)&CHAR(10)&\"Matière : \"&Mardi!$D72&CHAR(10)&\"Compétences : \"&Mardi!$G72))","v":""},{"$f":"IF(AND(Mercredi!$D72=\"\",Mercredi!$G72=\"\"),\"\",IF(Mercredi!$D72=\"Récréation\",CONCATENATE(Mercredi!$A72&\" / \"&Mercredi!$B72)&CHAR(10)&\"RECREATION\",CONCATENATE(Mercredi!$A72&\" / \"&Mercredi!$B72)&CHAR(10)&\"Matière : \"&Mercredi!$D72&CHAR(10)&\"Compétences : \"&Mercredi!$G72))","v":""},{"$f":"IF(AND(Jeudi!$D72=\"\",Jeudi!$G72=\"\"),\"\",IF(Jeudi!$D72=\"Récréation\",CONCATENATE(Jeudi!$A72&\" / \"&Jeudi!$B72)&CHAR(10)&\"RECREATION\",CONCATENATE(Jeudi!$A72&\" / \"&Jeudi!$B72)&CHAR(10)&\"Matière : \"&Jeudi!$D72&CHAR(10)&\"Compétences : \"&Jeudi!$G72))","v":""},{"$f":"IF(AND(Vendredi!$D72=\"\",Vendredi!$G72=\"\"),\"\",IF(Vendredi!$D72=\"Récréation\",CONCATENATE(Vendredi!$A72&\" / \"&Vendredi!$B72)&CHAR(10)&\"RECREATION\",CONCATENATE(Vendredi!$A72&\" / \"&Vendredi!$B72)&CHAR(10)&\"Matière : \"&Vendredi!$D72&CHAR(10)&\"Compétences : \"&Vendredi!$G72))","v":""}]
[{"$f":"IF(AND(Lundi!$D73=\"\",Lundi!$G73=\"\"),\"\",IF(Lundi!$D73=\"Récréation\",CONCATENATE(Lundi!A73&\" / \"&Lundi!B73)&CHAR(10)&\"RECREATION\",CONCATENATE(Lundi!A73&\" / \"&Lundi!B73)&CHAR(10)&\"Matière : \"&Lundi!$D73&CHAR(10)&\"Compétences : \"&Lundi!$G73))","v":""},{"$f":"IF(AND(Mardi!$D73=\"\",Mardi!$G73=\"\"),\"\",IF(Mardi!$D73=\"Récréation\",CONCATENATE(Mardi!$A73&\" / \"&Mardi!$B73)&CHAR(10)&\"RECREATION\",CONCATENATE(Mardi!$A73&\" / \"&Mardi!$B73)&CHAR(10)&\"Matière : \"&Mardi!$D73&CHAR(10)&\"Compétences : \"&Mardi!$G73))","v":""},{"$f":"IF(AND(Mercredi!$D73=\"\",Mercredi!$G73=\"\"),\"\",IF(Mercredi!$D73=\"Récréation\",CONCATENATE(Mercredi!$A73&\" / \"&Mercredi!$B73)&CHAR(10)&\"RECREATION\",CONCATENATE(Mercredi!$A73&\" / \"&Mercredi!$B73)&CHAR(10)&\"Matière : \"&Mercredi!$D73&CHAR(10)&\"Compétences : \"&Mercredi!$G73))","v":""},{"$f":"IF(AND(Jeudi!$D73=\"\",Jeudi!$G73=\"\"),\"\",IF(Jeudi!$D73=\"Récréation\",CONCATENATE(Jeudi!$A73&\" / \"&Jeudi!$B73)&CHAR(10)&\"RECREATION\",CONCATENATE(Jeudi!$A73&\" / \"&Jeudi!$B73)&CHAR(10)&\"Matière : \"&Jeudi!$D73&CHAR(10)&\"Compétences : \"&Jeudi!$G73))","v":""},{"$f":"IF(AND(Vendredi!$D73=\"\",Vendredi!$G73=\"\"),\"\",IF(Vendredi!$D73=\"Récréation\",CONCATENATE(Vendredi!$A73&\" / \"&Vendredi!$B73)&CHAR(10)&\"RECREATION\",CONCATENATE(Vendredi!$A73&\" / \"&Vendredi!$B73)&CHAR(10)&\"Matière : \"&Vendredi!$D73&CHAR(10)&\"Compétences : \"&Vendredi!$G73))","v":""}]
[{"$f":"IF(AND(Lundi!$D74=\"\",Lundi!$G74=\"\"),\"\",IF(Lundi!$D74=\"Récréation\",CONCATENATE(Lundi!A74&\" / \"&Lundi!B74)&CHAR(10)&\"RECREATION\",CONCATENATE(Lundi!A74&\" / \"&Lundi!B74)&CHAR(10)&\"Matière : \"&Lundi!$D74&CHAR(10)&\"Compétences : \"&Lundi!$G74))","v":""},{"$f":"IF(AND(Mardi!$D74=\"\",Mardi!$G74=\"\"),\"\",IF(Mardi!$D74=\"Récréation\",CONCATENATE(Mardi!$A74&\" / \"&Mardi!$B74)&CHAR(10)&\"RECREATION\",CONCATENATE(Mardi!$A74&\" / \"&Mardi!$B74)&CHAR(10)&\"Matière : \"&Mardi!$D74&CHAR(10)&\"Compétences : \"&Mardi!$G74))","v":""},{"$f":"IF(AND(Mercredi!$D74=\"\",Mercredi!$G74=\"\"),\"\",IF(Mercredi!$D74=\"Récréation\",CONCATENATE(Mercredi!$A74&\" / \"&Mercredi!$B74)&CHAR(10)&\"RECREATION\",CONCATENATE(Mercredi!$A74&\" / \"&Mercredi!$B74)&CHAR(10)&\"Matière : \"&Mercredi!$D74&CHAR(10)&\"Compétences : \"&Mercredi!$G74))","v":""},{"$f":"IF(AND(Jeudi!$D74=\"\",Jeudi!$G74=\"\"),\"\",IF(Jeudi!$D74=\"Récréation\",CONCATENATE(Jeudi!$A74&\" / \"&Jeudi!$B74)&CHAR(10)&\"RECREATION\",CONCATENATE(Jeudi!$A74&\" / \"&Jeudi!$B74)&CHAR(10)&\"Matière : \"&Jeudi!$D74&CHAR(10)&\"Compétences : \"&Jeudi!$G74))","v":""},{"$f":"IF(AND(Vendredi!$D74=\"\",Vendredi!$G74=\"\"),\"\",IF(Vendredi!$D74=\"Récréation\",CONCATENATE(Vendredi!$A74&\" / \"&Vendredi!$B74)&CHAR(10)&\"RECREATION\",CONCATENATE(Vendredi!$A74&\" / \"&Vendredi!$B74)&CHAR(10)&\"Matière : \"&Vendredi!$D74&CHAR(10)&\"Compétences : \"&Vendredi!$G74))","v":""}]
[{"$f":"IF(AND(Lundi!$D75=\"\",Lundi!$G75=\"\"),\"\",IF(Lundi!$D75=\"Récréation\",CONCATENATE(Lundi!A75&\" / \"&Lundi!B75)&CHAR(10)&\"RECREATION\",CONCATENATE(Lundi!A75&\" / \"&Lundi!B75)&CHAR(10)&\"Matière : \"&Lundi!$D75&CHAR(10)&\"Compétences : \"&Lundi!$G75))","v":""},{"$f":"IF(AND(Mardi!$D75=\"\",Mardi!$G75=\"\"),\"\",IF(Mardi!$D75=\"Récréation\",CONCATENATE(Mardi!$A75&\" / \"&Mardi!$B75)&CHAR(10)&\"RECREATION\",CONCATENATE(Mardi!$A75&\" / \"&Mardi!$B75)&CHAR(10)&\"Matière : \"&Mardi!$D75&CHAR(10)&\"Compétences : \"&Mardi!$G75))","v":""},{"$f":"IF(AND(Mercredi!$D75=\"\",Mercredi!$G75=\"\"),\"\",IF(Mercredi!$D75=\"Récréation\",CONCATENATE(Mercredi!$A75&\" / \"&Mercredi!$B75)&CHAR(10)&\"RECREATION\",CONCATENATE(Mercredi!$A75&\" / \"&Mercredi!$B75)&CHAR(10)&\"Matière : \"&Mercredi!$D75&CHAR(10)&\"Compétences : \"&Mercredi!$G75))","v":""},{"$f":"IF(AND(Jeudi!$D75=\"\",Jeudi!$G75=\"\"),\"\",IF(Jeudi!$D75=\"Récréation\",CONCATENATE(Jeudi!$A75&\" / \"&Jeudi!$B75)&CHAR(10)&\"RECREATION\",CONCATENATE(Jeudi!$A75&\" / \"&Jeudi!$B75)&CHAR(10)&\"Matière : \"&Jeudi!$D75&CHAR(10)&\"Compétences : \"&Jeudi!$G75))","v":""},{"$f":"IF(AND(Vendredi!$D75=\"\",Vendredi!$G75=\"\"),\"\",IF(Vendredi!$D75=\"Récréation\",CONCATENATE(Vendredi!$A75&\" / \"&Vendredi!$B75)&CHAR(10)&\"RECREATION\",CONCATENATE(Vendredi!$A75&\" / \"&Vendredi!$B75)&CHAR(10)&\"Matière : \"&Vendredi!$D75&CHAR(10)&\"Compétences : \"&Vendredi!$G75))","v":""}]
[{"$f":"IF(AND(Lundi!$D76=\"\",Lundi!$G76=\"\"),\"\",IF(Lundi!$D76=\"Récréation\",CONCATENATE(Lundi!A76&\" / \"&Lundi!B76)&CHAR(10)&\"RECREATION\",CONCATENATE(Lundi!A76&\" / \"&Lundi!B76)&CHAR(10)&\"Matière : \"&Lundi!$D76&CHAR(10)&\"Compétences : \"&Lundi!$G76))","v":""},{"$f":"IF(AND(Mardi!$D76=\"\",Mardi!$G76=\"\"),\"\",IF(Mardi!$D76=\"Récréation\",CONCATENATE(Mardi!$A76&\" / \"&Mardi!$B76)&CHAR(10)&\"RECREATION\",CONCATENATE(Mardi!$A76&\" / \"&Mardi!$B76)&CHAR(10)&\"Matière : \"&Mardi!$D76&CHAR(10)&\"Compétences : \"&Mardi!$G76))","v":""},{"$f":"IF(AND(Mercredi!$D76=\"\",Mercredi!$G76=\"\"),\"\",IF(Mercredi!$D76=\"Récréation\",CONCATENATE(Mercredi!$A76&\" / \"&Mercredi!$B76)&CHAR(10)&\"RECREATION\",CONCATENATE(Mercredi!$A76&\" / \"&Mercredi!$B76)&CHAR(10)&\"Matière : \"&Mercredi!$D76&CHAR(10)&\"Compétences : \"&Mercredi!$G76))","v":""},{"$f":"IF(AND(Jeudi!$D76=\"\",Jeudi!$G76=\"\"),\"\",IF(Jeudi!$D76=\"Récréation\",CONCATENATE(Jeudi!$A76&\" / \"&Jeudi!$B76)&CHAR(10)&\"RECREATION\",CONCATENATE(Jeudi!$A76&\" / \"&Jeudi!$B76)&CHAR(10)&\"Matière : \"&Jeudi!$D76&CHAR(10)&\"Compétences : \"&Jeudi!$G76))","v":""},{"$f":"IF(AND(Vendredi!$D76=\"\",Vendredi!$G76=\"\"),\"\",IF(Vendredi!$D76=\"Récréation\",CONCATENATE(Vendredi!$A76&\" / \"&Vendredi!$B76)&CHAR(10)&\"RECREATION\",CONCATENATE(Vendredi!$A76&\" / \"&Vendredi!$B76)&CHAR(10)&\"Matière : \"&Vendredi!$D76&CHAR(10)&\"Compétences : \"&Vendredi!$G76))","v":""}]
[{"$f":"IF(AND(Lundi!$D77=\"\",Lundi!$G77=\"\"),\"\",IF(Lundi!$D77=\"Récréation\",CONCATENATE(Lundi!A77&\" / \"&Lundi!B77)&CHAR(10)&\"RECREATION\",CONCATENATE(Lundi!A77&\" / \"&Lundi!B77)&CHAR(10)&\"Matière : \"&Lundi!$D77&CHAR(10)&\"Compétences : \"&Lundi!$G77))","v":""},{"$f":"IF(AND(Mardi!$D77=\"\",Mardi!$G77=\"\"),\"\",IF(Mardi!$D77=\"Récréation\",CONCATENATE(Mardi!$A77&\" / \"&Mardi!$B77)&CHAR(10)&\"RECREATION\",CONCATENATE(Mardi!$A77&\" / \"&Mardi!$B77)&CHAR(10)&\"Matière : \"&Mardi!$D77&CHAR(10)&\"Compétences : \"&Mardi!$G77))","v":""},{"$f":"IF(AND(Mercredi!$D77=\"\",Mercredi!$G77=\"\"),\"\",IF(Mercredi!$D77=\"Récréation\",CONCATENATE(Mercredi!$A77&\" / \"&Mercredi!$B77)&CHAR(10)&\"RECREATION\",CONCATENATE(Mercredi!$A77&\" / \"&Mercredi!$B77)&CHAR(10)&\"Matière : \"&Mercredi!$D77&CHAR(10)&\"Compétences : \"&Mercredi!$G77))","v":""},{"$f":"IF(AND(Jeudi!$D77=\"\",Jeudi!$G77=\"\"),\"\",IF(Jeudi!$D77=\"Récréation\",CONCATENATE(Jeudi!$A77&\" / \"&Jeudi!$B77)&CHAR(10)&\"RECREATION\",CONCATENATE(Jeudi!$A77&\" / \"&Jeudi!$B77)&CHAR(10)&\"Matière : \"&Jeudi!$D77&CHAR(10)&\"Compétences : \"&Jeudi!$G77))","v":""},{"$f":"IF(AND(Vendredi!$D77=\"\",Vendredi!$G77=\"\"),\"\",IF(Vendredi!$D77=\"Récréation\",CONCATENATE(Vendredi!$A77&\" / \"&Vendredi!$B77)&CHAR(10)&\"RECREATION\",CONCATENATE(Vendredi!$A77&\" / \"&Vendredi!$B77)&CHAR(10)&\"Matière : \"&Vendredi!$D77&CHAR(10)&\"Compétences : \"&Vendredi!$G77))","v":""}]
[{"$f":"IF(AND(Lundi!$D78=\"\",Lundi!$G78=\"\"),\"\",IF(Lundi!$D78=\"Récréation\",CONCATENATE(Lundi!A78&\" / \"&Lundi!B78)&CHAR(10)&\"RECREATION\",CONCATENATE(Lundi!A78&\" / \"&Lundi!B78)&CHAR(10)&\"Matière : \"&Lundi!$D78&CHAR(10)&\"Compétences : \"&Lundi!$G78))","v":""},{"$f":"IF(AND(Mardi!$D78=\"\",Mardi!$G78=\"\"),\"\",IF(Mardi!$D78=\"Récréation\",CONCATENATE(Mardi!$A78&\" / \"&Mardi!$B78)&CHAR(10)&\"RECREATION\",CONCATENATE(Mardi!$A78&\" / \"&Mardi!$B78)&CHAR(10)&\"Matière : \"&Mardi!$D78&CHAR(10)&\"Compétences : \"&Mardi!$G78))","v":""},{"$f":"IF(AND(Mercredi!$D78=\"\",Mercredi!$G78=\"\"),\"\",IF(Mercredi!$D78=\"Récréation\",CONCATENATE(Mercredi!$A78&\" / \"&Mercredi!$B78)&CHAR(10)&\"RECREATION\",CONCATENATE(Mercredi!$A78&\" / \"&Mercredi!$B78)&CHAR(10)&\"Matière : \"&Mercredi!$D78&CHAR(10)&\"Compétences : \"&Mercredi!$G78))","v":""},{"$f":"IF(AND(Jeudi!$D78=\"\",Jeudi!$G78=\"\"),\"\",IF(Jeudi!$D78=\"Récréation\",CONCATENATE(Jeudi!$A78&\" / \"&Jeudi!$B78)&CHAR(10)&\"RECREATION\",CONCATENATE(Jeudi!$A78&\" / \"&Jeudi!$B78)&CHAR(10)&\"Matière : \"&Jeudi!$D78&CHAR(10)&\"Compétences : \"&Jeudi!$G78))","v":""},{"$f":"IF(AND(Vendredi!$D78=\"\",Vendredi!$G78=\"\"),\"\",IF(Vendredi!$D78=\"Récréation\",CONCATENATE(Vendredi!$A78&\" / \"&Vendredi!$B78)&CHAR(10)&\"RECREATION\",CONCATENATE(Vendredi!$A78&\" / \"&Vendredi!$B78)&CHAR(10)&\"Matière : \"&Vendredi!$D78&CHAR(10)&\"Compétences : \"&Vendredi!$G78))","v":""}]
[{"$f":"IF(AND(Lundi!$D79=\"\",Lundi!$G79=\"\"),\"\",IF(Lundi!$D79=\"Récréation\",CONCATENATE(Lundi!A79&\" / \"&Lundi!B79)&CHAR(10)&\"RECREATION\",CONCATENATE(Lundi!A79&\" / \"&Lundi!B79)&CHAR(10)&\"Matière : \"&Lundi!$D79&CHAR(10)&\"Compétences : \"&Lundi!$G79))","v":""},{"$f":"IF(AND(Mardi!$D79=\"\",Mardi!$G79=\"\"),\"\",IF(Mardi!$D79=\"Récréation\",CONCATENATE(Mardi!$A79&\" / \"&Mardi!$B79)&CHAR(10)&\"RECREATION\",CONCATENATE(Mardi!$A79&\" / \"&Mardi!$B79)&CHAR(10)&\"Matière : \"&Mardi!$D79&CHAR(10)&\"Compétences : \"&Mardi!$G79))","v":""},{"$f":"IF(AND(Mercredi!$D79=\"\",Mercredi!$G79=\"\"),\"\",IF(Mercredi!$D79=\"Récréation\",CONCATENATE(Mercredi!$A79&\" / \"&Mercredi!$B79)&CHAR(10)&\"RECREATION\",CONCATENATE(Mercredi!$A79&\" / \"&Mercredi!$B79)&CHAR(10)&\"Matière : \"&Mercredi!$D79&CHAR(10)&\"Compétences : \"&Mercredi!$G79))","v":""},{"$f":"IF(AND(Jeudi!$D79=\"\",Jeudi!$G79=\"\"),\"\",IF(Jeudi!$D79=\"Récréation\",CONCATENATE(Jeudi!$A79&\" / \"&Jeudi!$B79)&CHAR(10)&\"RECREATION\",CONCATENATE(Jeudi!$A79&\" / \"&Jeudi!$B79)&CHAR(10)&\"Matière : \"&Jeudi!$D79&CHAR(10)&\"Compétences : \"&Jeudi!$G79))","v":""},{"$f":"IF(AND(Vendredi!$D79=\"\",Vendredi!$G79=\"\"),\"\",IF(Vendredi!$D79=\"Récréation\",CONCATENATE(Vendredi!$A79&\" / \"&Vendredi!$B79)&CHAR(10)&\"RECREATION\",CONCATENATE(Vendredi!$A79&\" / \"&Vendredi!$B79)&CHAR(10)&\"Matière : \"&Vendredi!$D79&CHAR(10)&\"Compétences : \"&Vendredi!$G79))","v":""}]
[{"$f":"IF(AND(Lundi!$D80=\"\",Lundi!$G80=\"\"),\"\",IF(Lundi!$D80=\"Récréation\",CONCATENATE(Lundi!A80&\" / \"&Lundi!B80)&CHAR(10)&\"RECREATION\",CONCATENATE(Lundi!A80&\" / \"&Lundi!B80)&CHAR(10)&\"Matière : \"&Lundi!$D80&CHAR(10)&\"Compétences : \"&Lundi!$G80))","v":""},{"$f":"IF(AND(Mardi!$D80=\"\",Mardi!$G80=\"\"),\"\",IF(Mardi!$D80=\"Récréation\",CONCATENATE(Mardi!$A80&\" / \"&Mardi!$B80)&CHAR(10)&\"RECREATION\",CONCATENATE(Mardi!$A80&\" / \"&Mardi!$B80)&CHAR(10)&\"Matière : \"&Mardi!$D80&CHAR(10)&\"Compétences : \"&Mardi!$G80))","v":""},{"$f":"IF(AND(Mercredi!$D80=\"\",Mercredi!$G80=\"\"),\"\",IF(Mercredi!$D80=\"Récréation\",CONCATENATE(Mercredi!$A80&\" / \"&Mercredi!$B80)&CHAR(10)&\"RECREATION\",CONCATENATE(Mercredi!$A80&\" / \"&Mercredi!$B80)&CHAR(10)&\"Matière : \"&Mercredi!$D80&CHAR(10)&\"Compétences : \"&Mercredi!$G80))","v":""},{"$f":"IF(AND(Jeudi!$D80=\"\",Jeudi!$G80=\"\"),\"\",IF(Jeudi!$D80=\"Récréation\",CONCATENATE(Jeudi!$A80&\" / \"&Jeudi!$B80)&CHAR(10)&\"RECREATION\",CONCATENATE(Jeudi!$A80&\" / \"&Jeudi!$B80)&CHAR(10)&\"Matière : \"&Jeudi!$D80&CHAR(10)&\"Compétences : \"&Jeudi!$G80))","v":""},{"$f":"IF(AND(Vendredi!$D80=\"\",Vendredi!$G80=\"\"),\"\",IF(Vendredi!$D80=\"Récréation\",CONCATENATE(Vendredi!$A80&\" / \"&Vendredi!$B80)&CHAR(10)&\"RECREATION\",CONCATENATE(Vendredi!$A80&\" / \"&Vendredi!$B80)&CHAR(10)&\"Matière : \"&Vendredi!$D80&CHAR(10)&\"Compétences : \"&Vendredi!$G80))","v":""}]
[{"$f":"IF(AND(Lundi!$D81=\"\",Lundi!$G81=\"\"),\"\",IF(Lundi!$D81=\"Récréation\",CONCATENATE(Lundi!A81&\" / \"&Lundi!B81)&CHAR(10)&\"RECREATION\",CONCATENATE(Lundi!A81&\" / \"&Lundi!B81)&CHAR(10)&\"Matière : \"&Lundi!$D81&CHAR(10)&\"Compétences : \"&Lundi!$G81))","v":""},{"$f":"IF(AND(Mardi!$D81=\"\",Mardi!$G81=\"\"),\"\",IF(Mardi!$D81=\"Récréation\",CONCATENATE(Mardi!$A81&\" / \"&Mardi!$B81)&CHAR(10)&\"RECREATION\",CONCATENATE(Mardi!$A81&\" / \"&Mardi!$B81)&CHAR(10)&\"Matière : \"&Mardi!$D81&CHAR(10)&\"Compétences : \"&Mardi!$G81))","v":""},{"$f":"IF(AND(Mercredi!$D81=\"\",Mercredi!$G81=\"\"),\"\",IF(Mercredi!$D81=\"Récréation\",CONCATENATE(Mercredi!$A81&\" / \"&Mercredi!$B81)&CHAR(10)&\"RECREATION\",CONCATENATE(Mercredi!$A81&\" / \"&Mercredi!$B81)&CHAR(10)&\"Matière : \"&Mercredi!$D81&CHAR(10)&\"Compétences : \"&Mercredi!$G81))","v":""},{"$f":"IF(AND(Jeudi!$D81=\"\",Jeudi!$G81=\"\"),\"\",IF(Jeudi!$D81=\"Récréation\",CONCATENATE(Jeudi!$A81&\" / \"&Jeudi!$B81)&CHAR(10)&\"RECREATION\",CONCATENATE(Jeudi!$A81&\" / \"&Jeudi!$B81)&CHAR(10)&\"Matière : \"&Jeudi!$D81&CHAR(10)&\"Compétences : \"&Jeudi!$G81))","v":""},{"$f":"IF(AND(Vendredi!$D81=\"\",Vendredi!$G81=\"\"),\"\",IF(Vendredi!$D81=\"Récréation\",CONCATENATE(Vendredi!$A81&\" / \"&Vendredi!$B81)&CHAR(10)&\"RECREATION\",CONCATENATE(Vendredi!$A81&\" / \"&Vendredi!$B81)&CHAR(10)&\"Matière : \"&Vendredi!$D81&CHAR(10)&\"Compétences : \"&Vendredi!$G81))","v":""}]
[{"$f":"IF(AND(Lundi!$D82=\"\",Lundi!$G82=\"\"),\"\",IF(Lundi!$D82=\"Récréation\",CONCATENATE(Lundi!A82&\" / \"&Lundi!B82)&CHAR(10)&\"RECREATION\",CONCATENATE(Lundi!A82&\" / \"&Lundi!B82)&CHAR(10)&\"Matière : \"&Lundi!$D82&CHAR(10)&\"Compétences : \"&Lundi!$G82))","v":""},{"$f":"IF(AND(Mardi!$D82=\"\",Mardi!$G82=\"\"),\"\",IF(Mardi!$D82=\"Récréation\",CONCATENATE(Mardi!$A82&\" / \"&Mardi!$B82)&CHAR(10)&\"RECREATION\",CONCATENATE(Mardi!$A82&\" / \"&Mardi!$B82)&CHAR(10)&\"Matière : \"&Mardi!$D82&CHAR(10)&\"Compétences : \"&Mardi!$G82))","v":""},{"$f":"IF(AND(Mercredi!$D82=\"\",Mercredi!$G82=\"\"),\"\",IF(Mercredi!$D82=\"Récréation\",CONCATENATE(Mercredi!$A82&\" / \"&Mercredi!$B82)&CHAR(10)&\"RECREATION\",CONCATENATE(Mercredi!$A82&\" / \"&Mercredi!$B82)&CHAR(10)&\"Matière : \"&Mercredi!$D82&CHAR(10)&\"Compétences : \"&Mercredi!$G82))","v":""},{"$f":"IF(AND(Jeudi!$D82=\"\",Jeudi!$G82=\"\"),\"\",IF(Jeudi!$D82=\"Récréation\",CONCATENATE(Jeudi!$A82&\" / \"&Jeudi!$B82)&CHAR(10)&\"RECREATION\",CONCATENATE(Jeudi!$A82&\" / \"&Jeudi!$B82)&CHAR(10)&\"Matière : \"&Jeudi!$D82&CHAR(10)&\"Compétences : \"&Jeudi!$G82))","v":""},{"$f":"IF(AND(Vendredi!$D82=\"\",Vendredi!$G82=\"\"),\"\",IF(Vendredi!$D82=\"Récréation\",CONCATENATE(Vendredi!$A82&\" / \"&Vendredi!$B82)&CHAR(10)&\"RECREATION\",CONCATENATE(Vendredi!$A82&\" / \"&Vendredi!$B82)&CHAR(10)&\"Matière : \"&Vendredi!$D82&CHAR(10)&\"Compétences : \"&Vendredi!$G82))","v":""}]
[{"$f":"IF(AND(Lundi!$D83=\"\",Lundi!$G83=\"\"),\"\",IF(Lundi!$D83=\"Récréation\",CONCATENATE(Lundi!A83&\" / \"&Lundi!B83)&CHAR(10)&\"RECREATION\",CONCATENATE(Lundi!A83&\" / \"&Lundi!B83)&CHAR(10)&\"Matière : \"&Lundi!$D83&CHAR(10)&\"Compétences : \"&Lundi!$G83))","v":""},{"$f":"IF(AND(Mardi!$D83=\"\",Mardi!$G83=\"\"),\"\",IF(Mardi!$D83=\"Récréation\",CONCATENATE(Mardi!$A83&\" / \"&Mardi!$B83)&CHAR(10)&\"RECREATION\",CONCATENATE(Mardi!$A83&\" / \"&Mardi!$B83)&CHAR(10)&\"Matière : \"&Mardi!$D83&CHAR(10)&\"Compétences : \"&Mardi!$G83))","v":""},{"$f":"IF(AND(Mercredi!$D83=\"\",Mercredi!$G83=\"\"),\"\",IF(Mercredi!$D83=\"Récréation\",CONCATENATE(Mercredi!$A83&\" / \"&Mercredi!$B83)&CHAR(10)&\"RECREATION\",CONCATENATE(Mercredi!$A83&\" / \"&Mercredi!$B83)&CHAR(10)&\"Matière : \"&Mercredi!$D83&CHAR(10)&\"Compétences : \"&Mercredi!$G83))","v":""},{"$f":"IF(AND(Jeudi!$D83=\"\",Jeudi!$G83=\"\"),\"\",IF(Jeudi!$D83=\"Récréation\",CONCATENATE(Jeudi!$A83&\" / \"&Jeudi!$B83)&CHAR(10)&\"RECREATION\",CONCATENATE(Jeudi!$A83&\" / \"&Jeudi!$B83)&CHAR(10)&\"Matière : \"&Jeudi!$D83&CHAR(10)&\"Compétences : \"&Jeudi!$G83))","v":""},{"$f":"IF(AND(Vendredi!$D83=\"\",Vendredi!$G83=\"\"),\"\",IF(Vendredi!$D83=\"Récréation\",CONCATENATE(Vendredi!$A83&\" / \"&Vendredi!$B83)&CHAR(10)&\"RECREATION\",CONCATENATE(Vendredi!$A83&\" / \"&Vendredi!$B83)&CHAR(10)&\"Matière : \"&Vendredi!$D83&CHAR(10)&\"Compétences : \"&Vendredi!$G83))","v":""}]
[{"$f":"IF(AND(Lundi!$D84=\"\",Lundi!$G84=\"\"),\"\",IF(Lundi!$D84=\"Récréation\",CONCATENATE(Lundi!A84&\" / \"&Lundi!B84)&CHAR(10)&\"RECREATION\",CONCATENATE(Lundi!A84&\" / \"&Lundi!B84)&CHAR(10)&\"Matière : \"&Lundi!$D84&CHAR(10)&\"Compétences : \"&Lundi!$G84))","v":""},{"$f":"IF(AND(Mardi!$D84=\"\",Mardi!$G84=\"\"),\"\",IF(Mardi!$D84=\"Récréation\",CONCATENATE(Mardi!$A84&\" / \"&Mardi!$B84)&CHAR(10)&\"RECREATION\",CONCATENATE(Mardi!$A84&\" / \"&Mardi!$B84)&CHAR(10)&\"Matière : \"&Mardi!$D84&CHAR(10)&\"Compétences : \"&Mardi!$G84))","v":""},{"$f":"IF(AND(Mercredi!$D84=\"\",Mercredi!$G84=\"\"),\"\",IF(Mercredi!$D84=\"Récréation\",CONCATENATE(Mercredi!$A84&\" / \"&Mercredi!$B84)&CHAR(10)&\"RECREATION\",CONCATENATE(Mercredi!$A84&\" / \"&Mercredi!$B84)&CHAR(10)&\"Matière : \"&Mercredi!$D84&CHAR(10)&\"Compétences : \"&Mercredi!$G84))","v":""},{"$f":"IF(AND(Jeudi!$D84=\"\",Jeudi!$G84=\"\"),\"\",IF(Jeudi!$D84=\"Récréation\",CONCATENATE(Jeudi!$A84&\" / \"&Jeudi!$B84)&CHAR(10)&\"RECREATION\",CONCATENATE(Jeudi!$A84&\" / \"&Jeudi!$B84)&CHAR(10)&\"Matière : \"&Jeudi!$D84&CHAR(10)&\"Compétences : \"&Jeudi!$G84))","v":""},{"$f":"IF(AND(Vendredi!$D84=\"\",Vendredi!$G84=\"\"),\"\",IF(Vendredi!$D84=\"Récréation\",CONCATENATE(Vendredi!$A84&\" / \"&Vendredi!$B84)&CHAR(10)&\"RECREATION\",CONCATENATE(Vendredi!$A84&\" / \"&Vendredi!$B84)&CHAR(10)&\"Matière : \"&Vendredi!$D84&CHAR(10)&\"Compétences : \"&Vendredi!$G84))","v":""}]
[{"$f":"IF(AND(Lundi!$D85=\"\",Lundi!$G85=\"\"),\"\",IF(Lundi!$D85=\"Récréation\",CONCATENATE(Lundi!A85&\" / \"&Lundi!B85)&CHAR(10)&\"RECREATION\",CONCATENATE(Lundi!A85&\" / \"&Lundi!B85)&CHAR(10)&\"Matière : \"&Lundi!$D85&CHAR(10)&\"Compétences : \"&Lundi!$G85))","v":""},{"$f":"IF(AND(Mardi!$D85=\"\",Mardi!$G85=\"\"),\"\",IF(Mardi!$D85=\"Récréation\",CONCATENATE(Mardi!$A85&\" / \"&Mardi!$B85)&CHAR(10)&\"RECREATION\",CONCATENATE(Mardi!$A85&\" / \"&Mardi!$B85)&CHAR(10)&\"Matière : \"&Mardi!$D85&CHAR(10)&\"Compétences : \"&Mardi!$G85))","v":""},{"$f":"IF(AND(Mercredi!$D85=\"\",Mercredi!$G85=\"\"),\"\",IF(Mercredi!$D85=\"Récréation\",CONCATENATE(Mercredi!$A85&\" / \"&Mercredi!$B85)&CHAR(10)&\"RECREATION\",CONCATENATE(Mercredi!$A85&\" / \"&Mercredi!$B85)&CHAR(10)&\"Matière : \"&Mercredi!$D85&CHAR(10)&\"Compétences : \"&Mercredi!$G85))","v":""},{"$f":"IF(AND(Jeudi!$D85=\"\",Jeudi!$G85=\"\"),\"\",IF(Jeudi!$D85=\"Récréation\",CONCATENATE(Jeudi!$A85&\" / \"&Jeudi!$B85)&CHAR(10)&\"RECREATION\",CONCATENATE(Jeudi!$A85&\" / \"&Jeudi!$B85)&CHAR(10)&\"Matière : \"&Jeudi!$D85&CHAR(10)&\"Compétences : \"&Jeudi!$G85))","v":""},{"$f":"IF(AND(Vendredi!$D85=\"\",Vendredi!$G85=\"\"),\"\",IF(Vendredi!$D85=\"Récréation\",CONCATENATE(Vendredi!$A85&\" / \"&Vendredi!$B85)&CHAR(10)&\"RECREATION\",CONCATENATE(Vendredi!$A85&\" / \"&Vendredi!$B85)&CHAR(10)&\"Matière : \"&Vendredi!$D85&CHAR(10)&\"Compétences : \"&Vendredi!$G85))","v":""}]
[{"$f":"IF(AND(Lundi!$D86=\"\",Lundi!$G86=\"\"),\"\",IF(Lundi!$D86=\"Récréation\",CONCATENATE(Lundi!A86&\" / \"&Lundi!B86)&CHAR(10)&\"RECREATION\",CONCATENATE(Lundi!A86&\" / \"&Lundi!B86)&CHAR(10)&\"Matière : \"&Lundi!$D86&CHAR(10)&\"Compétences : \"&Lundi!$G86))","v":""},{"$f":"IF(AND(Mardi!$D86=\"\",Mardi!$G86=\"\"),\"\",IF(Mardi!$D86=\"Récréation\",CONCATENATE(Mardi!$A86&\" / \"&Mardi!$B86)&CHAR(10)&\"RECREATION\",CONCATENATE(Mardi!$A86&\" / \"&Mardi!$B86)&CHAR(10)&\"Matière : \"&Mardi!$D86&CHAR(10)&\"Compétences : \"&Mardi!$G86))","v":""},{"$f":"IF(AND(Mercredi!$D86=\"\",Mercredi!$G86=\"\"),\"\",IF(Mercredi!$D86=\"Récréation\",CONCATENATE(Mercredi!$A86&\" / \"&Mercredi!$B86)&CHAR(10)&\"RECREATION\",CONCATENATE(Mercredi!$A86&\" / \"&Mercredi!$B86)&CHAR(10)&\"Matière : \"&Mercredi!$D86&CHAR(10)&\"Compétences : \"&Mercredi!$G86))","v":""},{"$f":"IF(AND(Jeudi!$D86=\"\",Jeudi!$G86=\"\"),\"\",IF(Jeudi!$D86=\"Récréation\",CONCATENATE(Jeudi!$A86&\" / \"&Jeudi!$B86)&CHAR(10)&\"RECREATION\",CONCATENATE(Jeudi!$A86&\" / \"&Jeudi!$B86)&CHAR(10)&\"Matière : \"&Jeudi!$D86&CHAR(10)&\"Compétences : \"&Jeudi!$G86))","v":""},{"$f":"IF(AND(Vendredi!$D86=\"\",Vendredi!$G86=\"\"),\"\",IF(Vendredi!$D86=\"Récréation\",CONCATENATE(Vendredi!$A86&\" / \"&Vendredi!$B86)&CHAR(10)&\"RECREATION\",CONCATENATE(Vendredi!$A86&\" / \"&Vendredi!$B86)&CHAR(10)&\"Matière : \"&Vendredi!$D86&CHAR(10)&\"Compétences : \"&Vendredi!$G86))","v":""}]
[{"$f":"IF(AND(Lundi!$D87=\"\",Lundi!$G87=\"\"),\"\",IF(Lundi!$D87=\"Récréation\",CONCATENATE(Lundi!A87&\" / \"&Lundi!B87)&CHAR(10)&\"RECREATION\",CONCATENATE(Lundi!A87&\" / \"&Lundi!B87)&CHAR(10)&\"Matière : \"&Lundi!$D87&CHAR(10)&\"Compétences : \"&Lundi!$G87))","v":""},{"$f":"IF(AND(Mardi!$D87=\"\",Mardi!$G87=\"\"),\"\",IF(Mardi!$D87=\"Récréation\",CONCATENATE(Mardi!$A87&\" / \"&Mardi!$B87)&CHAR(10)&\"RECREATION\",CONCATENATE(Mardi!$A87&\" / \"&Mardi!$B87)&CHAR(10)&\"Matière : \"&Mardi!$D87&CHAR(10)&\"Compétences : \"&Mardi!$G87))","v":""},{"$f":"IF(AND(Mercredi!$D87=\"\",Mercredi!$G87=\"\"),\"\",IF(Mercredi!$D87=\"Récréation\",CONCATENATE(Mercredi!$A87&\" / \"&Mercredi!$B87)&CHAR(10)&\"RECREATION\",CONCATENATE(Mercredi!$A87&\" / \"&Mercredi!$B87)&CHAR(10)&\"Matière : \"&Mercredi!$D87&CHAR(10)&\"Compétences : \"&Mercredi!$G87))","v":""},{"$f":"IF(AND(Jeudi!$D87=\"\",Jeudi!$G87=\"\"),\"\",IF(Jeudi!$D87=\"Récréation\",CONCATENATE(Jeudi!$A87&\" / \"&Jeudi!$B87)&CHAR(10)&\"RECREATION\",CONCATENATE(Jeudi!$A87&\" / \"&Jeudi!$B87)&CHAR(10)&\"Matière : \"&Jeudi!$D87&CHAR(10)&\"Compétences : \"&Jeudi!$G87))","v":""},{"$f":"IF(AND(Vendredi!$D87=\"\",Vendredi!$G87=\"\"),\"\",IF(Vendredi!$D87=\"Récréation\",CONCATENATE(Vendredi!$A87&\" / \"&Vendredi!$B87)&CHAR(10)&\"RECREATION\",CONCATENATE(Vendredi!$A87&\" / \"&Vendredi!$B87)&CHAR(10)&\"Matière : \"&Vendredi!$D87&CHAR(10)&\"Compétences : \"&Vendredi!$G87))","v":""}]
[{"$f":"IF(AND(Lundi!$D88=\"\",Lundi!$G88=\"\"),\"\",IF(Lundi!$D88=\"Récréation\",CONCATENATE(Lundi!A88&\" / \"&Lundi!B88)&CHAR(10)&\"RECREATION\",CONCATENATE(Lundi!A88&\" / \"&Lundi!B88)&CHAR(10)&\"Matière : \"&Lundi!$D88&CHAR(10)&\"Compétences : \"&Lundi!$G88))","v":""},{"$f":"IF(AND(Mardi!$D88=\"\",Mardi!$G88=\"\"),\"\",IF(Mardi!$D88=\"Récréation\",CONCATENATE(Mardi!$A88&\" / \"&Mardi!$B88)&CHAR(10)&\"RECREATION\",CONCATENATE(Mardi!$A88&\" / \"&Mardi!$B88)&CHAR(10)&\"Matière : \"&Mardi!$D88&CHAR(10)&\"Compétences : \"&Mardi!$G88))","v":""},{"$f":"IF(AND(Mercredi!$D88=\"\",Mercredi!$G88=\"\"),\"\",IF(Mercredi!$D88=\"Récréation\",CONCATENATE(Mercredi!$A88&\" / \"&Mercredi!$B88)&CHAR(10)&\"RECREATION\",CONCATENATE(Mercredi!$A88&\" / \"&Mercredi!$B88)&CHAR(10)&\"Matière : \"&Mercredi!$D88&CHAR(10)&\"Compétences : \"&Mercredi!$G88))","v":""},{"$f":"IF(AND(Jeudi!$D88=\"\",Jeudi!$G88=\"\"),\"\",IF(Jeudi!$D88=\"Récréation\",CONCATENATE(Jeudi!$A88&\" / \"&Jeudi!$B88)&CHAR(10)&\"RECREATION\",CONCATENATE(Jeudi!$A88&\" / \"&Jeudi!$B88)&CHAR(10)&\"Matière : \"&Jeudi!$D88&CHAR(10)&\"Compétences : \"&Jeudi!$G88))","v":""},{"$f":"IF(AND(Vendredi!$D88=\"\",Vendredi!$G88=\"\"),\"\",IF(Vendredi!$D88=\"Récréation\",CONCATENATE(Vendredi!$A88&\" / \"&Vendredi!$B88)&CHAR(10)&\"RECREATION\",CONCATENATE(Vendredi!$A88&\" / \"&Vendredi!$B88)&CHAR(10)&\"Matière : \"&Vendredi!$D88&CHAR(10)&\"Compétences : \"&Vendredi!$G88))","v":""}]
[{"$f":"IF(AND(Lundi!$D89=\"\",Lundi!$G89=\"\"),\"\",IF(Lundi!$D89=\"Récréation\",CONCATENATE(Lundi!A89&\" / \"&Lundi!B89)&CHAR(10)&\"RECREATION\",CONCATENATE(Lundi!A89&\" / \"&Lundi!B89)&CHAR(10)&\"Matière : \"&Lundi!$D89&CHAR(10)&\"Compétences : \"&Lundi!$G89))","v":""},{"$f":"IF(AND(Mardi!$D89=\"\",Mardi!$G89=\"\"),\"\",IF(Mardi!$D89=\"Récréation\",CONCATENATE(Mardi!$A89&\" / \"&Mardi!$B89)&CHAR(10)&\"RECREATION\",CONCATENATE(Mardi!$A89&\" / \"&Mardi!$B89)&CHAR(10)&\"Matière : \"&Mardi!$D89&CHAR(10)&\"Compétences : \"&Mardi!$G89))","v":""},{"$f":"IF(AND(Mercredi!$D89=\"\",Mercredi!$G89=\"\"),\"\",IF(Mercredi!$D89=\"Récréation\",CONCATENATE(Mercredi!$A89&\" / \"&Mercredi!$B89)&CHAR(10)&\"RECREATION\",CONCATENATE(Mercredi!$A89&\" / \"&Mercredi!$B89)&CHAR(10)&\"Matière : \"&Mercredi!$D89&CHAR(10)&\"Compétences : \"&Mercredi!$G89))","v":""},{"$f":"IF(AND(Jeudi!$D89=\"\",Jeudi!$G89=\"\"),\"\",IF(Jeudi!$D89=\"Récréation\",CONCATENATE(Jeudi!$A89&\" / \"&Jeudi!$B89)&CHAR(10)&\"RECREATION\",CONCATENATE(Jeudi!$A89&\" / \"&Jeudi!$B89)&CHAR(10)&\"Matière : \"&Jeudi!$D89&CHAR(10)&\"Compétences : \"&Jeudi!$G89))","v":""},{"$f":"IF(AND(Vendredi!$D89=\"\",Vendredi!$G89=\"\"),\"\",IF(Vendredi!$D89=\"Récréation\",CONCATENATE(Vendredi!$A89&\" / \"&Vendredi!$B89)&CHAR(10)&\"RECREATION\",CONCATENATE(Vendredi!$A89&\" / \"&Vendredi!$B89)&CHAR(10)&\"Matière : \"&Vendredi!$D89&CHAR(10)&\"Compétences : \"&Vendredi!$G89))","v":""}]
[{"$f":"IF(AND(Lundi!$D90=\"\",Lundi!$G90=\"\"),\"\",IF(Lundi!$D90=\"Récréation\",CONCATENATE(Lundi!A90&\" / \"&Lundi!B90)&CHAR(10)&\"RECREATION\",CONCATENATE(Lundi!A90&\" / \"&Lundi!B90)&CHAR(10)&\"Matière : \"&Lundi!$D90&CHAR(10)&\"Compétences : \"&Lundi!$G90))","v":""},{"$f":"IF(AND(Mardi!$D90=\"\",Mardi!$G90=\"\"),\"\",IF(Mardi!$D90=\"Récréation\",CONCATENATE(Mardi!$A90&\" / \"&Mardi!$B90)&CHAR(10)&\"RECREATION\",CONCATENATE(Mardi!$A90&\" / \"&Mardi!$B90)&CHAR(10)&\"Matière : \"&Mardi!$D90&CHAR(10)&\"Compétences : \"&Mardi!$G90))","v":""},{"$f":"IF(AND(Mercredi!$D90=\"\",Mercredi!$G90=\"\"),\"\",IF(Mercredi!$D90=\"Récréation\",CONCATENATE(Mercredi!$A90&\" / \"&Mercredi!$B90)&CHAR(10)&\"RECREATION\",CONCATENATE(Mercredi!$A90&\" / \"&Mercredi!$B90)&CHAR(10)&\"Matière : \"&Mercredi!$D90&CHAR(10)&\"Compétences : \"&Mercredi!$G90))","v":""},{"$f":"IF(AND(Jeudi!$D90=\"\",Jeudi!$G90=\"\"),\"\",IF(Jeudi!$D90=\"Récréation\",CONCATENATE(Jeudi!$A90&\" / \"&Jeudi!$B90)&CHAR(10)&\"RECREATION\",CONCATENATE(Jeudi!$A90&\" / \"&Jeudi!$B90)&CHAR(10)&\"Matière : \"&Jeudi!$D90&CHAR(10)&\"Compétences : \"&Jeudi!$G90))","v":""},{"$f":"IF(AND(Vendredi!$D90=\"\",Vendredi!$G90=\"\"),\"\",IF(Vendredi!$D90=\"Récréation\",CONCATENATE(Vendredi!$A90&\" / \"&Vendredi!$B90)&CHAR(10)&\"RECREATION\",CONCATENATE(Vendredi!$A90&\" / \"&Vendredi!$B90)&CHAR(10)&\"Matière : \"&Vendredi!$D90&CHAR(10)&\"Compétences : \"&Vendredi!$G90))","v":""}]
[{"$f":"IF(AND(Lundi!$D91=\"\",Lundi!$G91=\"\"),\"\",IF(Lundi!$D91=\"Récréation\",CONCATENATE(Lundi!A91&\" / \"&Lundi!B91)&CHAR(10)&\"RECREATION\",CONCATENATE(Lundi!A91&\" / \"&Lundi!B91)&CHAR(10)&\"Matière : \"&Lundi!$D91&CHAR(10)&\"Compétences : \"&Lundi!$G91))","v":""},{"$f":"IF(AND(Mardi!$D91=\"\",Mardi!$G91=\"\"),\"\",IF(Mardi!$D91=\"Récréation\",CONCATENATE(Mardi!$A91&\" / \"&Mardi!$B91)&CHAR(10)&\"RECREATION\",CONCATENATE(Mardi!$A91&\" / \"&Mardi!$B91)&CHAR(10)&\"Matière : \"&Mardi!$D91&CHAR(10)&\"Compétences : \"&Mardi!$G91))","v":""},{"$f":"IF(AND(Mercredi!$D91=\"\",Mercredi!$G91=\"\"),\"\",IF(Mercredi!$D91=\"Récréation\",CONCATENATE(Mercredi!$A91&\" / \"&Mercredi!$B91)&CHAR(10)&\"RECREATION\",CONCATENATE(Mercredi!$A91&\" / \"&Mercredi!$B91)&CHAR(10)&\"Matière : \"&Mercredi!$D91&CHAR(10)&\"Compétences : \"&Mercredi!$G91))","v":""},{"$f":"IF(AND(Jeudi!$D91=\"\",Jeudi!$G91=\"\"),\"\",IF(Jeudi!$D91=\"Récréation\",CONCATENATE(Jeudi!$A91&\" / \"&Jeudi!$B91)&CHAR(10)&\"RECREATION\",CONCATENATE(Jeudi!$A91&\" / \"&Jeudi!$B91)&CHAR(10)&\"Matière : \"&Jeudi!$D91&CHAR(10)&\"Compétences : \"&Jeudi!$G91))","v":""},{"$f":"IF(AND(Vendredi!$D91=\"\",Vendredi!$G91=\"\"),\"\",IF(Vendredi!$D91=\"Récréation\",CONCATENATE(Vendredi!$A91&\" / \"&Vendredi!$B91)&CHAR(10)&\"RECREATION\",CONCATENATE(Vendredi!$A91&\" / \"&Vendredi!$B91)&CHAR(10)&\"Matière : \"&Vendredi!$D91&CHAR(10)&\"Compétences : \"&Vendredi!$G91))","v":""}]
[{"$f":"IF(AND(Lundi!$D92=\"\",Lundi!$G92=\"\"),\"\",IF(Lundi!$D92=\"Récréation\",CONCATENATE(Lundi!A92&\" / \"&Lundi!B92)&CHAR(10)&\"RECREATION\",CONCATENATE(Lundi!A92&\" / \"&Lundi!B92)&CHAR(10)&\"Matière : \"&Lundi!$D92&CHAR(10)&\"Compétences : \"&Lundi!$G92))","v":""},{"$f":"IF(AND(Mardi!$D92=\"\",Mardi!$G92=\"\"),\"\",IF(Mardi!$D92=\"Récréation\",CONCATENATE(Mardi!$A92&\" / \"&Mardi!$B92)&CHAR(10)&\"RECREATION\",CONCATENATE(Mardi!$A92&\" / \"&Mardi!$B92)&CHAR(10)&\"Matière : \"&Mardi!$D92&CHAR(10)&\"Compétences : \"&Mardi!$G92))","v":""},{"$f":"IF(AND(Mercredi!$D92=\"\",Mercredi!$G92=\"\"),\"\",IF(Mercredi!$D92=\"Récréation\",CONCATENATE(Mercredi!$A92&\" / \"&Mercredi!$B92)&CHAR(10)&\"RECREATION\",CONCATENATE(Mercredi!$A92&\" / \"&Mercredi!$B92)&CHAR(10)&\"Matière : \"&Mercredi!$D92&CHAR(10)&\"Compétences : \"&Mercredi!$G92))","v":""},{"$f":"IF(AND(Jeudi!$D92=\"\",Jeudi!$G92=\"\"),\"\",IF(Jeudi!$D92=\"Récréation\",CONCATENATE(Jeudi!$A92&\" / \"&Jeudi!$B92)&CHAR(10)&\"RECREATION\",CONCATENATE(Jeudi!$A92&\" / \"&Jeudi!$B92)&CHAR(10)&\"Matière : \"&Jeudi!$D92&CHAR(10)&\"Compétences : \"&Jeudi!$G92))","v":""},{"$f":"IF(AND(Vendredi!$D92=\"\",Vendredi!$G92=\"\"),\"\",IF(Vendredi!$D92=\"Récréation\",CONCATENATE(Vendredi!$A92&\" / \"&Vendredi!$B92)&CHAR(10)&\"RECREATION\",CONCATENATE(Vendredi!$A92&\" / \"&Vendredi!$B92)&CHAR(10)&\"Matière : \"&Vendredi!$D92&CHAR(10)&\"Compétences : \"&Vendredi!$G92))","v":""}]
[{"$f":"IF(AND(Lundi!$D93=\"\",Lundi!$G93=\"\"),\"\",IF(Lundi!$D93=\"Récréation\",CONCATENATE(Lundi!A93&\" / \"&Lundi!B93)&CHAR(10)&\"RECREATION\",CONCATENATE(Lundi!A93&\" / \"&Lundi!B93)&CHAR(10)&\"Matière : \"&Lundi!$D93&CHAR(10)&\"Compétences : \"&Lundi!$G93))","v":""},{"$f":"IF(AND(Mardi!$D93=\"\",Mardi!$G93=\"\"),\"\",IF(Mardi!$D93=\"Récréation\",CONCATENATE(Mardi!$A93&\" / \"&Mardi!$B93)&CHAR(10)&\"RECREATION\",CONCATENATE(Mardi!$A93&\" / \"&Mardi!$B93)&CHAR(10)&\"Matière : \"&Mardi!$D93&CHAR(10)&\"Compétences : \"&Mardi!$G93))","v":""},{"$f":"IF(AND(Mercredi!$D93=\"\",Mercredi!$G93=\"\"),\"\",IF(Mercredi!$D93=\"Récréation\",CONCATENATE(Mercredi!$A93&\" / \"&Mercredi!$B93)&CHAR(10)&\"RECREATION\",CONCATENATE(Mercredi!$A93&\" / \"&Mercredi!$B93)&CHAR(10)&\"Matière : \"&Mercredi!$D93&CHAR(10)&\"Compétences : \"&Mercredi!$G93))","v":""},{"$f":"IF(AND(Jeudi!$D93=\"\",Jeudi!$G93=\"\"),\"\",IF(Jeudi!$D93=\"Récréation\",CONCATENATE(Jeudi!$A93&\" / \"&Jeudi!$B93)&CHAR(10)&\"RECREATION\",CONCATENATE(Jeudi!$A93&\" / \"&Jeudi!$B93)&CHAR(10)&\"Matière : \"&Jeudi!$D93&CHAR(10)&\"Compétences : \"&Jeudi!$G93))","v":""},{"$f":"IF(AND(Vendredi!$D93=\"\",Vendredi!$G93=\"\"),\"\",IF(Vendredi!$D93=\"Récréation\",CONCATENATE(Vendredi!$A93&\" / \"&Vendredi!$B93)&CHAR(10)&\"RECREATION\",CONCATENATE(Vendredi!$A93&\" / \"&Vendredi!$B93)&CHAR(10)&\"Matière : \"&Vendredi!$D93&CHAR(10)&\"Compétences : \"&Vendredi!$G93))","v":""}]
[{"$f":"IF(AND(Lundi!$D94=\"\",Lundi!$G94=\"\"),\"\",IF(Lundi!$D94=\"Récréation\",CONCATENATE(Lundi!A94&\" / \"&Lundi!B94)&CHAR(10)&\"RECREATION\",CONCATENATE(Lundi!A94&\" / \"&Lundi!B94)&CHAR(10)&\"Matière : \"&Lundi!$D94&CHAR(10)&\"Compétences : \"&Lundi!$G94))","v":""},{"$f":"IF(AND(Mardi!$D94=\"\",Mardi!$G94=\"\"),\"\",IF(Mardi!$D94=\"Récréation\",CONCATENATE(Mardi!$A94&\" / \"&Mardi!$B94)&CHAR(10)&\"RECREATION\",CONCATENATE(Mardi!$A94&\" / \"&Mardi!$B94)&CHAR(10)&\"Matière : \"&Mardi!$D94&CHAR(10)&\"Compétences : \"&Mardi!$G94))","v":""},{"$f":"IF(AND(Mercredi!$D94=\"\",Mercredi!$G94=\"\"),\"\",IF(Mercredi!$D94=\"Récréation\",CONCATENATE(Mercredi!$A94&\" / \"&Mercredi!$B94)&CHAR(10)&\"RECREATION\",CONCATENATE(Mercredi!$A94&\" / \"&Mercredi!$B94)&CHAR(10)&\"Matière : \"&Mercredi!$D94&CHAR(10)&\"Compétences : \"&Mercredi!$G94))","v":""},{"$f":"IF(AND(Jeudi!$D94=\"\",Jeudi!$G94=\"\"),\"\",IF(Jeudi!$D94=\"Récréation\",CONCATENATE(Jeudi!$A94&\" / \"&Jeudi!$B94)&CHAR(10)&\"RECREATION\",CONCATENATE(Jeudi!$A94&\" / \"&Jeudi!$B94)&CHAR(10)&\"Matière : \"&Jeudi!$D94&CHAR(10)&\"Compétences : \"&Jeudi!$G94))","v":""},{"$f":"IF(AND(Vendredi!$D94=\"\",Vendredi!$G94=\"\"),\"\",IF(Vendredi!$D94=\"Récréation\",CONCATENATE(Vendredi!$A94&\" / \"&Vendredi!$B94)&CHAR(10)&\"RECREATION\",CONCATENATE(Vendredi!$A94&\" / \"&Vendredi!$B94)&CHAR(10)&\"Matière : \"&Vendredi!$D94&CHAR(10)&\"Compétences : \"&Vendredi!$G94))","v":""}]
[{"$f":"IF(AND(Lundi!$D95=\"\",Lundi!$G95=\"\"),\"\",IF(Lundi!$D95=\"Récréation\",CONCATENATE(Lundi!A95&\" / \"&Lundi!B95)&CHAR(10)&\"RECREATION\",CONCATENATE(Lundi!A95&\" / \"&Lundi!B95)&CHAR(10)&\"Matière : \"&Lundi!$D95&CHAR(10)&\"Compétences : \"&Lundi!$G95))","v":""},{"$f":"IF(AND(Mardi!$D95=\"\",Mardi!$G95=\"\"),\"\",IF(Mardi!$D95=\"Récréation\",CONCATENATE(Mardi!$A95&\" / \"&Mardi!$B95)&CHAR(10)&\"RECREATION\",CONCATENATE(Mardi!$A95&\" / \"&Mardi!$B95)&CHAR(10)&\"Matière : \"&Mardi!$D95&CHAR(10)&\"Compétences : \"&Mardi!$G95))","v":""},{"$f":"IF(AND(Mercredi!$D95=\"\",Mercredi!$G95=\"\"),\"\",IF(Mercredi!$D95=\"Récréation\",CONCATENATE(Mercredi!$A95&\" / \"&Mercredi!$B95)&CHAR(10)&\"RECREATION\",CONCATENATE(Mercredi!$A95&\" / \"&Mercredi!$B95)&CHAR(10)&\"Matière : \"&Mercredi!$D95&CHAR(10)&\"Compétences : \"&Mercredi!$G95))","v":""},{"$f":"IF(AND(Jeudi!$D95=\"\",Jeudi!$G95=\"\"),\"\",IF(Jeudi!$D95=\"Récréation\",CONCATENATE(Jeudi!$A95&\" / \"&Jeudi!$B95)&CHAR(10)&\"RECREATION\",CONCATENATE(Jeudi!$A95&\" / \"&Jeudi!$B95)&CHAR(10)&\"Matière : \"&Jeudi!$D95&CHAR(10)&\"Compétences : \"&Jeudi!$G95))","v":""},{"$f":"IF(AND(Vendredi!$D95=\"\",Vendredi!$G95=\"\"),\"\",IF(Vendredi!$D95=\"Récréation\",CONCATENATE(Vendredi!$A95&\" / \"&Vendredi!$B95)&CHAR(10)&\"RECREATION\",CONCATENATE(Vendredi!$A95&\" / \"&Vendredi!$B95)&CHAR(10)&\"Matière : \"&Vendredi!$D95&CHAR(10)&\"Compétences : \"&Vendredi!$G95))","v":""}]
[{"$f":"IF(AND(Lundi!$D96=\"\",Lundi!$G96=\"\"),\"\",IF(Lundi!$D96=\"Récréation\",CONCATENATE(Lundi!A96&\" / \"&Lundi!B96)&CHAR(10)&\"RECREATION\",CONCATENATE(Lundi!A96&\" / \"&Lundi!B96)&CHAR(10)&\"Matière : \"&Lundi!$D96&CHAR(10)&\"Compétences : \"&Lundi!$G96))","v":""},{"$f":"IF(AND(Mardi!$D96=\"\",Mardi!$G96=\"\"),\"\",IF(Mardi!$D96=\"Récréation\",CONCATENATE(Mardi!$A96&\" / \"&Mardi!$B96)&CHAR(10)&\"RECREATION\",CONCATENATE(Mardi!$A96&\" / \"&Mardi!$B96)&CHAR(10)&\"Matière : \"&Mardi!$D96&CHAR(10)&\"Compétences : \"&Mardi!$G96))","v":""},{"$f":"IF(AND(Mercredi!$D96=\"\",Mercredi!$G96=\"\"),\"\",IF(Mercredi!$D96=\"Récréation\",CONCATENATE(Mercredi!$A96&\" / \"&Mercredi!$B96)&CHAR(10)&\"RECREATION\",CONCATENATE(Mercredi!$A96&\" / \"&Mercredi!$B96)&CHAR(10)&\"Matière : \"&Mercredi!$D96&CHAR(10)&\"Compétences : \"&Mercredi!$G96))","v":""},{"$f":"IF(AND(Jeudi!$D96=\"\",Jeudi!$G96=\"\"),\"\",IF(Jeudi!$D96=\"Récréation\",CONCATENATE(Jeudi!$A96&\" / \"&Jeudi!$B96)&CHAR(10)&\"RECREATION\",CONCATENATE(Jeudi!$A96&\" / \"&Jeudi!$B96)&CHAR(10)&\"Matière : \"&Jeudi!$D96&CHAR(10)&\"Compétences : \"&Jeudi!$G96))","v":""},{"$f":"IF(AND(Vendredi!$D96=\"\",Vendredi!$G96=\"\"),\"\",IF(Vendredi!$D96=\"Récréation\",CONCATENATE(Vendredi!$A96&\" / \"&Vendredi!$B96)&CHAR(10)&\"RECREATION\",CONCATENATE(Vendredi!$A96&\" / \"&Vendredi!$B96)&CHAR(10)&\"Matière : \"&Vendredi!$D96&CHAR(10)&\"Compétences : \"&Vendredi!$G96))","v":""}]
[{"$f":"IF(AND(Lundi!$D97=\"\",Lundi!$G97=\"\"),\"\",IF(Lundi!$D97=\"Récréation\",CONCATENATE(Lundi!A97&\" / \"&Lundi!B97)&CHAR(10)&\"RECREATION\",CONCATENATE(Lundi!A97&\" / \"&Lundi!B97)&CHAR(10)&\"Matière : \"&Lundi!$D97&CHAR(10)&\"Compétences : \"&Lundi!$G97))","v":""},{"$f":"IF(AND(Mardi!$D97=\"\",Mardi!$G97=\"\"),\"\",IF(Mardi!$D97=\"Récréation\",CONCATENATE(Mardi!$A97&\" / \"&Mardi!$B97)&CHAR(10)&\"RECREATION\",CONCATENATE(Mardi!$A97&\" / \"&Mardi!$B97)&CHAR(10)&\"Matière : \"&Mardi!$D97&CHAR(10)&\"Compétences : \"&Mardi!$G97))","v":""},{"$f":"IF(AND(Mercredi!$D97=\"\",Mercredi!$G97=\"\"),\"\",IF(Mercredi!$D97=\"Récréation\",CONCATENATE(Mercredi!$A97&\" / \"&Mercredi!$B97)&CHAR(10)&\"RECREATION\",CONCATENATE(Mercredi!$A97&\" / \"&Mercredi!$B97)&CHAR(10)&\"Matière : \"&Mercredi!$D97&CHAR(10)&\"Compétences : \"&Mercredi!$G97))","v":""},{"$f":"IF(AND(Jeudi!$D97=\"\",Jeudi!$G97=\"\"),\"\",IF(Jeudi!$D97=\"Récréation\",CONCATENATE(Jeudi!$A97&\" / \"&Jeudi!$B97)&CHAR(10)&\"RECREATION\",CONCATENATE(Jeudi!$A97&\" / \"&Jeudi!$B97)&CHAR(10)&\"Matière : \"&Jeudi!$D97&CHAR(10)&\"Compétences : \"&Jeudi!$G97))","v":""},{"$f":"IF(AND(Vendredi!$D97=\"\",Vendredi!$G97=\"\"),\"\",IF(Vendredi!$D97=\"Récréation\",CONCATENATE(Vendredi!$A97&\" / \"&Vendredi!$B97)&CHAR(10)&\"RECREATION\",CONCATENATE(Vendredi!$A97&\" / \"&Vendredi!$B97)&CHAR(10)&\"Matière : \"&Vendredi!$D97&CHAR(10)&\"Compétences : \"&Vendredi!$G97))","v":""}]
[{"$f":"IF(AND(Lundi!$D98=\"\",Lundi!$G98=\"\"),\"\",IF(Lundi!$D98=\"Récréation\",CONCATENATE(Lundi!A98&\" / \"&Lundi!B98)&CHAR(10)&\"RECREATION\",CONCATENATE(Lundi!A98&\" / \"&Lundi!B98)&CHAR(10)&\"Matière : \"&Lundi!$D98&CHAR(10)&\"Compétences : \"&Lundi!$G98))","v":""},{"$f":"IF(AND(Mardi!$D98=\"\",Mardi!$G98=\"\"),\"\",IF(Mardi!$D98=\"Récréation\",CONCATENATE(Mardi!$A98&\" / \"&Mardi!$B98)&CHAR(10)&\"RECREATION\",CONCATENATE(Mardi!$A98&\" / \"&Mardi!$B98)&CHAR(10)&\"Matière : \"&Mardi!$D98&CHAR(10)&\"Compétences : \"&Mardi!$G98))","v":""},{"$f":"IF(AND(Mercredi!$D98=\"\",Mercredi!$G98=\"\"),\"\",IF(Mercredi!$D98=\"Récréation\",CONCATENATE(Mercredi!$A98&\" / \"&Mercredi!$B98)&CHAR(10)&\"RECREATION\",CONCATENATE(Mercredi!$A98&\" / \"&Mercredi!$B98)&CHAR(10)&\"Matière : \"&Mercredi!$D98&CHAR(10)&\"Compétences : \"&Mercredi!$G98))","v":""},{"$f":"IF(AND(Jeudi!$D98=\"\",Jeudi!$G98=\"\"),\"\",IF(Jeudi!$D98=\"Récréation\",CONCATENATE(Jeudi!$A98&\" / \"&Jeudi!$B98)&CHAR(10)&\"RECREATION\",CONCATENATE(Jeudi!$A98&\" / \"&Jeudi!$B98)&CHAR(10)&\"Matière : \"&Jeudi!$D98&CHAR(10)&\"Compétences : \"&Jeudi!$G98))","v":""},{"$f":"IF(AND(Vendredi!$D98=\"\",Vendredi!$G98=\"\"),\"\",IF(Vendredi!$D98=\"Récréation\",CONCATENATE(Vendredi!$A98&\" / \"&Vendredi!$B98)&CHAR(10)&\"RECREATION\",CONCATENATE(Vendredi!$A98&\" / \"&Vendredi!$B98)&CHAR(10)&\"Matière : \"&Vendredi!$D98&CHAR(10)&\"Compétences : \"&Vendredi!$G98))","v":""}]
[{"$f":"IF(AND(Lundi!$D99=\"\",Lundi!$G99=\"\"),\"\",IF(Lundi!$D99=\"Récréation\",CONCATENATE(Lundi!A99&\" / \"&Lundi!B99)&CHAR(10)&\"RECREATION\",CONCATENATE(Lundi!A99&\" / \"&Lundi!B99)&CHAR(10)&\"Matière : \"&Lundi!$D99&CHAR(10)&\"Compétences : \"&Lundi!$G99))","v":""},{"$f":"IF(AND(Mardi!$D99=\"\",Mardi!$G99=\"\"),\"\",IF(Mardi!$D99=\"Récréation\",CONCATENATE(Mardi!$A99&\" / \"&Mardi!$B99)&CHAR(10)&\"RECREATION\",CONCATENATE(Mardi!$A99&\" / \"&Mardi!$B99)&CHAR(10)&\"Matière : \"&Mardi!$D99&CHAR(10)&\"Compétences : \"&Mardi!$G99))","v":""},{"$f":"IF(AND(Mercredi!$D99=\"\",Mercredi!$G99=\"\"),\"\",IF(Mercredi!$D99=\"Récréation\",CONCATENATE(Mercredi!$A99&\" / \"&Mercredi!$B99)&CHAR(10)&\"RECREATION\",CONCATENATE(Mercredi!$A99&\" / \"&Mercredi!$B99)&CHAR(10)&\"Matière : \"&Mercredi!$D99&CHAR(10)&\"Compétences : \"&Mercredi!$G99))","v":""},{"$f":"IF(AND(Jeudi!$D99=\"\",Jeudi!$G99=\"\"),\"\",IF(Jeudi!$D99=\"Récréation\",CONCATENATE(Jeudi!$A99&\" / \"&Jeudi!$B99)&CHAR(10)&\"RECREATION\",CONCATENATE(Jeudi!$A99&\" / \"&Jeudi!$B99)&CHAR(10)&\"Matière : \"&Jeudi!$D99&CHAR(10)&\"Compétences : \"&Jeudi!$G99))","v":""},{"$f":"IF(AND(Vendredi!$D99=\"\",Vendredi!$G99=\"\"),\"\",IF(Vendredi!$D99=\"Récréation\",CONCATENATE(Vendredi!$A99&\" / \"&Vendredi!$B99)&CHAR(10)&\"RECREATION\",CONCATENATE(Vendredi!$A99&\" / \"&Vendredi!$B99)&CHAR(10)&\"Matière : \"&Vendredi!$D99&CHAR(10)&\"Compétences : \"&Vendredi!$G99))","v":""}]
[{"$f":"IF(AND(Lundi!$D100=\"\",Lundi!$G100=\"\"),\"\",IF(Lundi!$D100=\"Récréation\",CONCATENATE(Lundi!A100&\" / \"&Lundi!B100)&CHAR(10)&\"RECREATION\",CONCATENATE(Lundi!A100&\" / \"&Lundi!B100)&CHAR(10)&\"Matière : \"&Lundi!$D100&CHAR(10)&\"Compétences : \"&Lundi!$G100))","v":""},{"$f":"IF(AND(Mardi!$D100=\"\",Mardi!$G100=\"\"),\"\",IF(Mardi!$D100=\"Récréation\",CONCATENATE(Mardi!$A100&\" / \"&Mardi!$B100)&CHAR(10)&\"RECREATION\",CONCATENATE(Mardi!$A100&\" / \"&Mardi!$B100)&CHAR(10)&\"Matière : \"&Mardi!$D100&CHAR(10)&\"Compétences : \"&Mardi!$G100))","v":""},{"$f":"IF(AND(Mercredi!$D100=\"\",Mercredi!$G100=\"\"),\"\",IF(Mercredi!$D100=\"Récréation\",CONCATENATE(Mercredi!$A100&\" / \"&Mercredi!$B100)&CHAR(10)&\"RECREATION\",CONCATENATE(Mercredi!$A100&\" / \"&Mercredi!$B100)&CHAR(10)&\"Matière : \"&Mercredi!$D100&CHAR(10)&\"Compétences : \"&Mercredi!$G100))","v":""},{"$f":"IF(AND(Jeudi!$D100=\"\",Jeudi!$G100=\"\"),\"\",IF(Jeudi!$D100=\"Récréation\",CONCATENATE(Jeudi!$A100&\" / \"&Jeudi!$B100)&CHAR(10)&\"RECREATION\",CONCATENATE(Jeudi!$A100&\" / \"&Jeudi!$B100)&CHAR(10)&\"Matière : \"&Jeudi!$D100&CHAR(10)&\"Compétences : \"&Jeudi!$G100))","v":""},{"$f":"IF(AND(Vendredi!$D100=\"\",Vendredi!$G100=\"\"),\"\",IF(Vendredi!$D100=\"Récréation\",CONCATENATE(Vendredi!$A100&\" / \"&Vendredi!$B100)&CHAR(10)&\"RECREATION\",CONCATENATE(Vendredi!$A100&\" / \"&Vendredi!$B100)&CHAR(10)&\"Matière : \"&Vendredi!$D100&CHAR(10)&\"Compétences : \"&Vendredi!$G100))","v":""}]
[{"$f":"IF(AND(Lundi!$D101=\"\",Lundi!$G101=\"\"),\"\",IF(Lundi!$D101=\"Récréation\",CONCATENATE(Lundi!A101&\" / \"&Lundi!B101)&CHAR(10)&\"RECREATION\",CONCATENATE(Lundi!A101&\" / \"&Lundi!B101)&CHAR(10)&\"Matière : \"&Lundi!$D101&CHAR(10)&\"Compétences : \"&Lundi!$G101))","v":""},{"$f":"IF(AND(Mardi!$D101=\"\",Mardi!$G101=\"\"),\"\",IF(Mardi!$D101=\"Récréation\",CONCATENATE(Mardi!$A101&\" / \"&Mardi!$B101)&CHAR(10)&\"RECREATION\",CONCATENATE(Mardi!$A101&\" / \"&Mardi!$B101)&CHAR(10)&\"Matière : \"&Mardi!$D101&CHAR(10)&\"Compétences : \"&Mardi!$G101))","v":""},{"$f":"IF(AND(Mercredi!$D101=\"\",Mercredi!$G101=\"\"),\"\",IF(Mercredi!$D101=\"Récréation\",CONCATENATE(Mercredi!$A101&\" / \"&Mercredi!$B101)&CHAR(10)&\"RECREATION\",CONCATENATE(Mercredi!$A101&\" / \"&Mercredi!$B101)&CHAR(10)&\"Matière : \"&Mercredi!$D101&CHAR(10)&\"Compétences : \"&Mercredi!$G101))","v":""},{"$f":"IF(AND(Jeudi!$D101=\"\",Jeudi!$G101=\"\"),\"\",IF(Jeudi!$D101=\"Récréation\",CONCATENATE(Jeudi!$A101&\" / \"&Jeudi!$B101)&CHAR(10)&\"RECREATION\",CONCATENATE(Jeudi!$A101&\" / \"&Jeudi!$B101)&CHAR(10)&\"Matière : \"&Jeudi!$D101&CHAR(10)&\"Compétences : \"&Jeudi!$G101))","v":""},{"$f":"IF(AND(Vendredi!$D101=\"\",Vendredi!$G101=\"\"),\"\",IF(Vendredi!$D101=\"Récréation\",CONCATENATE(Vendredi!$A101&\" / \"&Vendredi!$B101)&CHAR(10)&\"RECREATION\",CONCATENATE(Vendredi!$A101&\" / \"&Vendredi!$B101)&CHAR(10)&\"Matière : \"&Vendredi!$D101&CHAR(10)&\"Compétences : \"&Vendredi!$G101))","v":""}]
[{"$f":"IF(AND(Lundi!$D102=\"\",Lundi!$G102=\"\"),\"\",IF(Lundi!$D102=\"Récréation\",CONCATENATE(Lundi!A102&\" / \"&Lundi!B102)&CHAR(10)&\"RECREATION\",CONCATENATE(Lundi!A102&\" / \"&Lundi!B102)&CHAR(10)&\"Matière : \"&Lundi!$D102&CHAR(10)&\"Compétences : \"&Lundi!$G102))","v":""},{"$f":"IF(AND(Mardi!$D102=\"\",Mardi!$G102=\"\"),\"\",IF(Mardi!$D102=\"Récréation\",CONCATENATE(Mardi!$A102&\" / \"&Mardi!$B102)&CHAR(10)&\"RECREATION\",CONCATENATE(Mardi!$A102&\" / \"&Mardi!$B102)&CHAR(10)&\"Matière : \"&Mardi!$D102&CHAR(10)&\"Compétences : \"&Mardi!$G102))","v":""},{"$f":"IF(AND(Mercredi!$D102=\"\",Mercredi!$G102=\"\"),\"\",IF(Mercredi!$D102=\"Récréation\",CONCATENATE(Mercredi!$A102&\" / \"&Mercredi!$B102)&CHAR(10)&\"RECREATION\",CONCATENATE(Mercredi!$A102&\" / \"&Mercredi!$B102)&CHAR(10)&\"Matière : \"&Mercredi!$D102&CHAR(10)&\"Compétences : \"&Mercredi!$G102))","v":""},{"$f":"IF(AND(Jeudi!$D102=\"\",Jeudi!$G102=\"\"),\"\",IF(Jeudi!$D102=\"Récréation\",CONCATENATE(Jeudi!$A102&\" / \"&Jeudi!$B102)&CHAR(10)&\"RECREATION\",CONCATENATE(Jeudi!$A102&\" / \"&Jeudi!$B102)&CHAR(10)&\"Matière : \"&Jeudi!$D102&CHAR(10)&\"Compétences : \"&Jeudi!$G102))","v":""},{"$f":"IF(AND(Vendredi!$D102=\"\",Vendredi!$G102=\"\"),\"\",IF(Vendredi!$D102=\"Récréation\",CONCATENATE(Vendredi!$A102&\" / \"&Vendredi!$B102)&CHAR(10)&\"RECREATION\",CONCATENATE(Vendredi!$A102&\" / \"&Vendredi!$B102)&CHAR(10)&\"Matière : \"&Vendredi!$D102&CHAR(10)&\"Compétences : \"&Vendredi!$G102))","v":""}]
[{"$f":"IF(AND(Lundi!$D103=\"\",Lundi!$G103=\"\"),\"\",IF(Lundi!$D103=\"Récréation\",CONCATENATE(Lundi!A103&\" / \"&Lundi!B103)&CHAR(10)&\"RECREATION\",CONCATENATE(Lundi!A103&\" / \"&Lundi!B103)&CHAR(10)&\"Matière : \"&Lundi!$D103&CHAR(10)&\"Compétences : \"&Lundi!$G103))","v":""},{"$f":"IF(AND(Mardi!$D103=\"\",Mardi!$G103=\"\"),\"\",IF(Mardi!$D103=\"Récréation\",CONCATENATE(Mardi!$A103&\" / \"&Mardi!$B103)&CHAR(10)&\"RECREATION\",CONCATENATE(Mardi!$A103&\" / \"&Mardi!$B103)&CHAR(10)&\"Matière : \"&Mardi!$D103&CHAR(10)&\"Compétences : \"&Mardi!$G103))","v":""},{"$f":"IF(AND(Mercredi!$D103=\"\",Mercredi!$G103=\"\"),\"\",IF(Mercredi!$D103=\"Récréation\",CONCATENATE(Mercredi!$A103&\" / \"&Mercredi!$B103)&CHAR(10)&\"RECREATION\",CONCATENATE(Mercredi!$A103&\" / \"&Mercredi!$B103)&CHAR(10)&\"Matière : \"&Mercredi!$D103&CHAR(10)&\"Compétences : \"&Mercredi!$G103))","v":""},{"$f":"IF(AND(Jeudi!$D103=\"\",Jeudi!$G103=\"\"),\"\",IF(Jeudi!$D103=\"Récréation\",CONCATENATE(Jeudi!$A103&\" / \"&Jeudi!$B103)&CHAR(10)&\"RECREATION\",CONCATENATE(Jeudi!$A103&\" / \"&Jeudi!$B103)&CHAR(10)&\"Matière : \"&Jeudi!$D103&CHAR(10)&\"Compétences : \"&Jeudi!$G103))","v":""},{"$f":"IF(AND(Vendredi!$D103=\"\",Vendredi!$G103=\"\"),\"\",IF(Vendredi!$D103=\"Récréation\",CONCATENATE(Vendredi!$A103&\" / \"&Vendredi!$B103)&CHAR(10)&\"RECREATION\",CONCATENATE(Vendredi!$A103&\" / \"&Vendredi!$B103)&CHAR(10)&\"Matière : \"&Vendredi!$D103&CHAR(10)&\"Compétences : \"&Vendredi!$G103))","v":""}]
[{"$f":"IF(AND(Lundi!$D104=\"\",Lundi!$G104=\"\"),\"\",IF(Lundi!$D104=\"Récréation\",CONCATENATE(Lundi!A104&\" / \"&Lundi!B104)&CHAR(10)&\"RECREATION\",CONCATENATE(Lundi!A104&\" / \"&Lundi!B104)&CHAR(10)&\"Matière : \"&Lundi!$D104&CHAR(10)&\"Compétences : \"&Lundi!$G104))","v":""},{"$f":"IF(AND(Mardi!$D104=\"\",Mardi!$G104=\"\"),\"\",IF(Mardi!$D104=\"Récréation\",CONCATENATE(Mardi!$A104&\" / \"&Mardi!$B104)&CHAR(10)&\"RECREATION\",CONCATENATE(Mardi!$A104&\" / \"&Mardi!$B104)&CHAR(10)&\"Matière : \"&Mardi!$D104&CHAR(10)&\"Compétences : \"&Mardi!$G104))","v":""},{"$f":"IF(AND(Mercredi!$D104=\"\",Mercredi!$G104=\"\"),\"\",IF(Mercredi!$D104=\"Récréation\",CONCATENATE(Mercredi!$A104&\" / \"&Mercredi!$B104)&CHAR(10)&\"RECREATION\",CONCATENATE(Mercredi!$A104&\" / \"&Mercredi!$B104)&CHAR(10)&\"Matière : \"&Mercredi!$D104&CHAR(10)&\"Compétences : \"&Mercredi!$G104))","v":""},{"$f":"IF(AND(Jeudi!$D104=\"\",Jeudi!$G104=\"\"),\"\",IF(Jeudi!$D104=\"Récréation\",CONCATENATE(Jeudi!$A104&\" / \"&Jeudi!$B104)&CHAR(10)&\"RECREATION\",CONCATENATE(Jeudi!$A104&\" / \"&Jeudi!$B104)&CHAR(10)&\"Matière : \"&Jeudi!$D104&CHAR(10)&\"Compétences : \"&Jeudi!$G104))","v":""},{"$f":"IF(AND(Vendredi!$D104=\"\",Vendredi!$G104=\"\"),\"\",IF(Vendredi!$D104=\"Récréation\",CONCATENATE(Vendredi!$A104&\" / \"&Vendredi!$B104)&CHAR(10)&\"RECREATION\",CONCATENATE(Vendredi!$A104&\" / \"&Vendredi!$B104)&CHAR(10)&\"Matière : \"&Vendredi!$D104&CHAR(10)&\"Compétences : \"&Vendredi!$G104))","v":""}]
[{"$f":"IF(AND(Lundi!$D105=\"\",Lundi!$G105=\"\"),\"\",IF(Lundi!$D105=\"Récréation\",CONCATENATE(Lundi!A105&\" / \"&Lundi!B105)&CHAR(10)&\"RECREATION\",CONCATENATE(Lundi!A105&\" / \"&Lundi!B105)&CHAR(10)&\"Matière : \"&Lundi!$D105&CHAR(10)&\"Compétences : \"&Lundi!$G105))","v":""},{"$f":"IF(AND(Mardi!$D105=\"\",Mardi!$G105=\"\"),\"\",IF(Mardi!$D105=\"Récréation\",CONCATENATE(Mardi!$A105&\" / \"&Mardi!$B105)&CHAR(10)&\"RECREATION\",CONCATENATE(Mardi!$A105&\" / \"&Mardi!$B105)&CHAR(10)&\"Matière : \"&Mardi!$D105&CHAR(10)&\"Compétences : \"&Mardi!$G105))","v":""},{"$f":"IF(AND(Mercredi!$D105=\"\",Mercredi!$G105=\"\"),\"\",IF(Mercredi!$D105=\"Récréation\",CONCATENATE(Mercredi!$A105&\" / \"&Mercredi!$B105)&CHAR(10)&\"RECREATION\",CONCATENATE(Mercredi!$A105&\" / \"&Mercredi!$B105)&CHAR(10)&\"Matière : \"&Mercredi!$D105&CHAR(10)&\"Compétences : \"&Mercredi!$G105))","v":""},{"$f":"IF(AND(Jeudi!$D105=\"\",Jeudi!$G105=\"\"),\"\",IF(Jeudi!$D105=\"Récréation\",CONCATENATE(Jeudi!$A105&\" / \"&Jeudi!$B105)&CHAR(10)&\"RECREATION\",CONCATENATE(Jeudi!$A105&\" / \"&Jeudi!$B105)&CHAR(10)&\"Matière : \"&Jeudi!$D105&CHAR(10)&\"Compétences : \"&Jeudi!$G105))","v":""},{"$f":"IF(AND(Vendredi!$D105=\"\",Vendredi!$G105=\"\"),\"\",IF(Vendredi!$D105=\"Récréation\",CONCATENATE(Vendredi!$A105&\" / \"&Vendredi!$B105)&CHAR(10)&\"RECREATION\",CONCATENATE(Vendredi!$A105&\" / \"&Vendredi!$B105)&CHAR(10)&\"Matière : \"&Vendredi!$D105&CHAR(10)&\"Compétences : \"&Vendredi!$G105))","v":""}]
[{"$f":"IF(AND(Lundi!$D106=\"\",Lundi!$G106=\"\"),\"\",IF(Lundi!$D106=\"Récréation\",CONCATENATE(Lundi!A106&\" / \"&Lundi!B106)&CHAR(10)&\"RECREATION\",CONCATENATE(Lundi!A106&\" / \"&Lundi!B106)&CHAR(10)&\"Matière : \"&Lundi!$D106&CHAR(10)&\"Compétences : \"&Lundi!$G106))","v":""},{"$f":"IF(AND(Mardi!$D106=\"\",Mardi!$G106=\"\"),\"\",IF(Mardi!$D106=\"Récréation\",CONCATENATE(Mardi!$A106&\" / \"&Mardi!$B106)&CHAR(10)&\"RECREATION\",CONCATENATE(Mardi!$A106&\" / \"&Mardi!$B106)&CHAR(10)&\"Matière : \"&Mardi!$D106&CHAR(10)&\"Compétences : \"&Mardi!$G106))","v":""},{"$f":"IF(AND(Mercredi!$D106=\"\",Mercredi!$G106=\"\"),\"\",IF(Mercredi!$D106=\"Récréation\",CONCATENATE(Mercredi!$A106&\" / \"&Mercredi!$B106)&CHAR(10)&\"RECREATION\",CONCATENATE(Mercredi!$A106&\" / \"&Mercredi!$B106)&CHAR(10)&\"Matière : \"&Mercredi!$D106&CHAR(10)&\"Compétences : \"&Mercredi!$G106))","v":""},{"$f":"IF(AND(Jeudi!$D106=\"\",Jeudi!$G106=\"\"),\"\",IF(Jeudi!$D106=\"Récréation\",CONCATENATE(Jeudi!$A106&\" / \"&Jeudi!$B106)&CHAR(10)&\"RECREATION\",CONCATENATE(Jeudi!$A106&\" / \"&Jeudi!$B106)&CHAR(10)&\"Matière : \"&Jeudi!$D106&CHAR(10)&\"Compétences : \"&Jeudi!$G106))","v":""},{"$f":"IF(AND(Vendredi!$D106=\"\",Vendredi!$G106=\"\"),\"\",IF(Vendredi!$D106=\"Récréation\",CONCATENATE(Vendredi!$A106&\" / \"&Vendredi!$B106)&CHAR(10)&\"RECREATION\",CONCATENATE(Vendredi!$A106&\" / \"&Vendredi!$B106)&CHAR(10)&\"Matière : \"&Vendredi!$D106&CHAR(10)&\"Compétences : \"&Vendredi!$G106))","v":""}]
[{"$f":"IF(AND(Lundi!$D107=\"\",Lundi!$G107=\"\"),\"\",IF(Lundi!$D107=\"Récréation\",CONCATENATE(Lundi!A107&\" / \"&Lundi!B107)&CHAR(10)&\"RECREATION\",CONCATENATE(Lundi!A107&\" / \"&Lundi!B107)&CHAR(10)&\"Matière : \"&Lundi!$D107&CHAR(10)&\"Compétences : \"&Lundi!$G107))","v":""},{"$f":"IF(AND(Mardi!$D107=\"\",Mardi!$G107=\"\"),\"\",IF(Mardi!$D107=\"Récréation\",CONCATENATE(Mardi!$A107&\" / \"&Mardi!$B107)&CHAR(10)&\"RECREATION\",CONCATENATE(Mardi!$A107&\" / \"&Mardi!$B107)&CHAR(10)&\"Matière : \"&Mardi!$D107&CHAR(10)&\"Compétences : \"&Mardi!$G107))","v":""},{"$f":"IF(AND(Mercredi!$D107=\"\",Mercredi!$G107=\"\"),\"\",IF(Mercredi!$D107=\"Récréation\",CONCATENATE(Mercredi!$A107&\" / \"&Mercredi!$B107)&CHAR(10)&\"RECREATION\",CONCATENATE(Mercredi!$A107&\" / \"&Mercredi!$B107)&CHAR(10)&\"Matière : \"&Mercredi!$D107&CHAR(10)&\"Compétences : \"&Mercredi!$G107))","v":""},{"$f":"IF(AND(Jeudi!$D107=\"\",Jeudi!$G107=\"\"),\"\",IF(Jeudi!$D107=\"Récréation\",CONCATENATE(Jeudi!$A107&\" / \"&Jeudi!$B107)&CHAR(10)&\"RECREATION\",CONCATENATE(Jeudi!$A107&\" / \"&Jeudi!$B107)&CHAR(10)&\"Matière : \"&Jeudi!$D107&CHAR(10)&\"Compétences : \"&Jeudi!$G107))","v":""},{"$f":"IF(AND(Vendredi!$D107=\"\",Vendredi!$G107=\"\"),\"\",IF(Vendredi!$D107=\"Récréation\",CONCATENATE(Vendredi!$A107&\" / \"&Vendredi!$B107)&CHAR(10)&\"RECREATION\",CONCATENATE(Vendredi!$A107&\" / \"&Vendredi!$B107)&CHAR(10)&\"Matière : \"&Vendredi!$D107&CHAR(10)&\"Compétences : \"&Vendredi!$G107))","v":""}]
[{"$f":"IF(AND(Lundi!$D108=\"\",Lundi!$G108=\"\"),\"\",IF(Lundi!$D108=\"Récréation\",CONCATENATE(Lundi!A108&\" / \"&Lundi!B108)&CHAR(10)&\"RECREATION\",CONCATENATE(Lundi!A108&\" / \"&Lundi!B108)&CHAR(10)&\"Matière : \"&Lundi!$D108&CHAR(10)&\"Compétences : \"&Lundi!$G108))","v":""},{"$f":"IF(AND(Mardi!$D108=\"\",Mardi!$G108=\"\"),\"\",IF(Mardi!$D108=\"Récréation\",CONCATENATE(Mardi!$A108&\" / \"&Mardi!$B108)&CHAR(10)&\"RECREATION\",CONCATENATE(Mardi!$A108&\" / \"&Mardi!$B108)&CHAR(10)&\"Matière : \"&Mardi!$D108&CHAR(10)&\"Compétences : \"&Mardi!$G108))","v":""},{"$f":"IF(AND(Mercredi!$D108=\"\",Mercredi!$G108=\"\"),\"\",IF(Mercredi!$D108=\"Récréation\",CONCATENATE(Mercredi!$A108&\" / \"&Mercredi!$B108)&CHAR(10)&\"RECREATION\",CONCATENATE(Mercredi!$A108&\" / \"&Mercredi!$B108)&CHAR(10)&\"Matière : \"&Mercredi!$D108&CHAR(10)&\"Compétences : \"&Mercredi!$G108))","v":""},{"$f":"IF(AND(Jeudi!$D108=\"\",Jeudi!$G108=\"\"),\"\",IF(Jeudi!$D108=\"Récréation\",CONCATENATE(Jeudi!$A108&\" / \"&Jeudi!$B108)&CHAR(10)&\"RECREATION\",CONCATENATE(Jeudi!$A108&\" / \"&Jeudi!$B108)&CHAR(10)&\"Matière : \"&Jeudi!$D108&CHAR(10)&\"Compétences : \"&Jeudi!$G108))","v":""},{"$f":"IF(AND(Vendredi!$D108=\"\",Vendredi!$G108=\"\"),\"\",IF(Vendredi!$D108=\"Récréation\",CONCATENATE(Vendredi!$A108&\" / \"&Vendredi!$B108)&CHAR(10)&\"RECREATION\",CONCATENATE(Vendredi!$A108&\" / \"&Vendredi!$B108)&CHAR(10)&\"Matière : \"&Vendredi!$D108&CHAR(10)&\"Compétences : \"&Vendredi!$G108))","v":""}]
[{"$f":"IF(AND(Lundi!$D109=\"\",Lundi!$G109=\"\"),\"\",IF(Lundi!$D109=\"Récréation\",CONCATENATE(Lundi!A109&\" / \"&Lundi!B109)&CHAR(10)&\"RECREATION\",CONCATENATE(Lundi!A109&\" / \"&Lundi!B109)&CHAR(10)&\"Matière : \"&Lundi!$D109&CHAR(10)&\"Compétences : \"&Lundi!$G109))","v":""},{"$f":"IF(AND(Mardi!$D109=\"\",Mardi!$G109=\"\"),\"\",IF(Mardi!$D109=\"Récréation\",CONCATENATE(Mardi!$A109&\" / \"&Mardi!$B109)&CHAR(10)&\"RECREATION\",CONCATENATE(Mardi!$A109&\" / \"&Mardi!$B109)&CHAR(10)&\"Matière : \"&Mardi!$D109&CHAR(10)&\"Compétences : \"&Mardi!$G109))","v":""},{"$f":"IF(AND(Mercredi!$D109=\"\",Mercredi!$G109=\"\"),\"\",IF(Mercredi!$D109=\"Récréation\",CONCATENATE(Mercredi!$A109&\" / \"&Mercredi!$B109)&CHAR(10)&\"RECREATION\",CONCATENATE(Mercredi!$A109&\" / \"&Mercredi!$B109)&CHAR(10)&\"Matière : \"&Mercredi!$D109&CHAR(10)&\"Compétences : \"&Mercredi!$G109))","v":""},{"$f":"IF(AND(Jeudi!$D109=\"\",Jeudi!$G109=\"\"),\"\",IF(Jeudi!$D109=\"Récréation\",CONCATENATE(Jeudi!$A109&\" / \"&Jeudi!$B109)&CHAR(10)&\"RECREATION\",CONCATENATE(Jeudi!$A109&\" / \"&Jeudi!$B109)&CHAR(10)&\"Matière : \"&Jeudi!$D109&CHAR(10)&\"Compétences : \"&Jeudi!$G109))","v":""},{"$f":"IF(AND(Vendredi!$D109=\"\",Vendredi!$G109=\"\"),\"\",IF(Vendredi!$D109=\"Récréation\",CONCATENATE(Vendredi!$A109&\" / \"&Vendredi!$B109)&CHAR(10)&\"RECREATION\",CONCATENATE(Vendredi!$A109&\" / \"&Vendredi!$B109)&CHAR(10)&\"Matière : \"&Vendredi!$D109&CHAR(10)&\"Compétences : \"&Vendredi!$G109))","v":""}]
[{"$f":"IF(AND(Lundi!$D110=\"\",Lundi!$G110=\"\"),\"\",IF(Lundi!$D110=\"Récréation\",CONCATENATE(Lundi!A110&\" / \"&Lundi!B110)&CHAR(10)&\"RECREATION\",CONCATENATE(Lundi!A110&\" / \"&Lundi!B110)&CHAR(10)&\"Matière : \"&Lundi!$D110&CHAR(10)&\"Compétences : \"&Lundi!$G110))","v":""},{"$f":"IF(AND(Mardi!$D110=\"\",Mardi!$G110=\"\"),\"\",IF(Mardi!$D110=\"Récréation\",CONCATENATE(Mardi!$A110&\" / \"&Mardi!$B110)&CHAR(10)&\"RECREATION\",CONCATENATE(Mardi!$A110&\" / \"&Mardi!$B110)&CHAR(10)&\"Matière : \"&Mardi!$D110&CHAR(10)&\"Compétences : \"&Mardi!$G110))","v":""},{"$f":"IF(AND(Mercredi!$D110=\"\",Mercredi!$G110=\"\"),\"\",IF(Mercredi!$D110=\"Récréation\",CONCATENATE(Mercredi!$A110&\" / \"&Mercredi!$B110)&CHAR(10)&\"RECREATION\",CONCATENATE(Mercredi!$A110&\" / \"&Mercredi!$B110)&CHAR(10)&\"Matière : \"&Mercredi!$D110&CHAR(10)&\"Compétences : \"&Mercredi!$G110))","v":""},{"$f":"IF(AND(Jeudi!$D110=\"\",Jeudi!$G110=\"\"),\"\",IF(Jeudi!$D110=\"Récréation\",CONCATENATE(Jeudi!$A110&\" / \"&Jeudi!$B110)&CHAR(10)&\"RECREATION\",CONCATENATE(Jeudi!$A110&\" / \"&Jeudi!$B110)&CHAR(10)&\"Matière : \"&Jeudi!$D110&CHAR(10)&\"Compétences : \"&Jeudi!$G110))","v":""},{"$f":"IF(AND(Vendredi!$D110=\"\",Vendredi!$G110=\"\"),\"\",IF(Vendredi!$D110=\"Récréation\",CONCATENATE(Vendredi!$A110&\" / \"&Vendredi!$B110)&CHAR(10)&\"RECREATION\",CONCATENATE(Vendredi!$A110&\" / \"&Vendredi!$B110)&CHAR(10)&\"Matière : \"&Vendredi!$D110&CHAR(10)&\"Compétences : \"&Vendredi!$G110))","v":""}]
[{"$f":"IF(AND(Lundi!$D111=\"\",Lundi!$G111=\"\"),\"\",IF(Lundi!$D111=\"Récréation\",CONCATENATE(Lundi!A111&\" / \"&Lundi!B111)&CHAR(10)&\"RECREATION\",CONCATENATE(Lundi!A111&\" / \"&Lundi!B111)&CHAR(10)&\"Matière : \"&Lundi!$D111&CHAR(10)&\"Compétences : \"&Lundi!$G111))","v":""},{"$f":"IF(AND(Mardi!$D111=\"\",Mardi!$G111=\"\"),\"\",IF(Mardi!$D111=\"Récréation\",CONCATENATE(Mardi!$A111&\" / \"&Mardi!$B111)&CHAR(10)&\"RECREATION\",CONCATENATE(Mardi!$A111&\" / \"&Mardi!$B111)&CHAR(10)&\"Matière : \"&Mardi!$D111&CHAR(10)&\"Compétences : \"&Mardi!$G111))","v":""},{"$f":"IF(AND(Mercredi!$D111=\"\",Mercredi!$G111=\"\"),\"\",IF(Mercredi!$D111=\"Récréation\",CONCATENATE(Mercredi!$A111&\" / \"&Mercredi!$B111)&CHAR(10)&\"RECREATION\",CONCATENATE(Mercredi!$A111&\" / \"&Mercredi!$B111)&CHAR(10)&\"Matière : \"&Mercredi!$D111&CHAR(10)&\"Compétences : \"&Mercredi!$G111))","v":""},{"$f":"IF(AND(Jeudi!$D111=\"\",Jeudi!$G111=\"\"),\"\",IF(Jeudi!$D111=\"Récréation\",CONCATENATE(Jeudi!$A111&\" / \"&Jeudi!$B111)&CHAR(10)&\"RECREATION\",CONCATENATE(Jeudi!$A111&\" / \"&Jeudi!$B111)&CHAR(10)&\"Matière : \"&Jeudi!$D111&CHAR(10)&\"Compétences : \"&Jeudi!$G111))","v":""},{"$f":"IF(AND(Vendredi!$D111=\"\",Vendredi!$G111=\"\"),\"\",IF(Vendredi!$D111=\"Récréation\",CONCATENATE(Vendredi!$A111&\" / \"&Vendredi!$B111)&CHAR(10)&\"RECREATION\",CONCATENATE(Vendredi!$A111&\" / \"&Vendredi!$B111)&CHAR(10)&\"Matière : \"&Vendredi!$D111&CHAR(10)&\"Compétences : \"&Vendredi!$G111))","v":""}]
[{"$f":"IF(AND(Lundi!$D112=\"\",Lundi!$G112=\"\"),\"\",IF(Lundi!$D112=\"Récréation\",CONCATENATE(Lundi!A112&\" / \"&Lundi!B112)&CHAR(10)&\"RECREATION\",CONCATENATE(Lundi!A112&\" / \"&Lundi!B112)&CHAR(10)&\"Matière : \"&Lundi!$D112&CHAR(10)&\"Compétences : \"&Lundi!$G112))","v":""},{"$f":"IF(AND(Mardi!$D112=\"\",Mardi!$G112=\"\"),\"\",IF(Mardi!$D112=\"Récréation\",CONCATENATE(Mardi!$A112&\" / \"&Mardi!$B112)&CHAR(10)&\"RECREATION\",CONCATENATE(Mardi!$A112&\" / \"&Mardi!$B112)&CHAR(10)&\"Matière : \"&Mardi!$D112&CHAR(10)&\"Compétences : \"&Mardi!$G112))","v":""},{"$f":"IF(AND(Mercredi!$D112=\"\",Mercredi!$G112=\"\"),\"\",IF(Mercredi!$D112=\"Récréation\",CONCATENATE(Mercredi!$A112&\" / \"&Mercredi!$B112)&CHAR(10)&\"RECREATION\",CONCATENATE(Mercredi!$A112&\" / \"&Mercredi!$B112)&CHAR(10)&\"Matière : \"&Mercredi!$D112&CHAR(10)&\"Compétences : \"&Mercredi!$G112))","v":""},{"$f":"IF(AND(Jeudi!$D112=\"\",Jeudi!$G112=\"\"),\"\",IF(Jeudi!$D112=\"Récréation\",CONCATENATE(Jeudi!$A112&\" / \"&Jeudi!$B112)&CHAR(10)&\"RECREATION\",CONCATENATE(Jeudi!$A112&\" / \"&Jeudi!$B112)&CHAR(10)&\"Matière : \"&Jeudi!$D112&CHAR(10)&\"Compétences : \"&Jeudi!$G112))","v":""},{"$f":"IF(AND(Vendredi!$D112=\"\",Vendredi!$G112=\"\"),\"\",IF(Vendredi!$D112=\"Récréation\",CONCATENATE(Vendredi!$A112&\" / \"&Vendredi!$B112)&CHAR(10)&\"RECREATION\",CONCATENATE(Vendredi!$A112&\" / \"&Vendredi!$B112)&CHAR(10)&\"Matière : \"&Vendredi!$D112&CHAR(10)&\"Compétences : \"&Vendredi!$G112))","v":""}]
[{"$f":"IF(AND(Lundi!$D113=\"\",Lundi!$G113=\"\"),\"\",IF(Lundi!$D113=\"Récréation\",CONCATENATE(Lundi!A113&\" / \"&Lundi!B113)&CHAR(10)&\"RECREATION\",CONCATENATE(Lundi!A113&\" / \"&Lundi!B113)&CHAR(10)&\"Matière : \"&Lundi!$D113&CHAR(10)&\"Compétences : \"&Lundi!$G113))","v":""},{"$f":"IF(AND(Mardi!$D113=\"\",Mardi!$G113=\"\"),\"\",IF(Mardi!$D113=\"Récréation\",CONCATENATE(Mardi!$A113&\" / \"&Mardi!$B113)&CHAR(10)&\"RECREATION\",CONCATENATE(Mardi!$A113&\" / \"&Mardi!$B113)&CHAR(10)&\"Matière : \"&Mardi!$D113&CHAR(10)&\"Compétences : \"&Mardi!$G113))","v":""},{"$f":"IF(AND(Mercredi!$D113=\"\",Mercredi!$G113=\"\"),\"\",IF(Mercredi!$D113=\"Récréation\",CONCATENATE(Mercredi!$A113&\" / \"&Mercredi!$B113)&CHAR(10)&\"RECREATION\",CONCATENATE(Mercredi!$A113&\" / \"&Mercredi!$B113)&CHAR(10)&\"Matière : \"&Mercredi!$D113&CHAR(10)&\"Compétences : \"&Mercredi!$G113))","v":""},{"$f":"IF(AND(Jeudi!$D113=\"\",Jeudi!$G113=\"\"),\"\",IF(Jeudi!$D113=\"Récréation\",CONCATENATE(Jeudi!$A113&\" / \"&Jeudi!$B113)&CHAR(10)&\"RECREATION\",CONCATENATE(Jeudi!$A113&\" / \"&Jeudi!$B113)&CHAR(10)&\"Matière : \"&Jeudi!$D113&CHAR(10)&\"Compétences : \"&Jeudi!$G113))","v":""},{"$f":"IF(AND(Vendredi!$D113=\"\",Vendredi!$G113=\"\"),\"\",IF(Vendredi!$D113=\"Récréation\",CONCATENATE(Vendredi!$A113&\" / \"&Vendredi!$B113)&CHAR(10)&\"RECREATION\",CONCATENATE(Vendredi!$A113&\" / \"&Vendredi!$B113)&CHAR(10)&\"Matière : \"&Vendredi!$D113&CHAR(10)&\"Compétences : \"&Vendredi!$G113))","v":""}]
[{"$f":"IF(AND(Lundi!$D114=\"\",Lundi!$G114=\"\"),\"\",IF(Lundi!$D114=\"Récréation\",CONCATENATE(Lundi!A114&\" / \"&Lundi!B114)&CHAR(10)&\"RECREATION\",CONCATENATE(Lundi!A114&\" / \"&Lundi!B114)&CHAR(10)&\"Matière : \"&Lundi!$D114&CHAR(10)&\"Compétences : \"&Lundi!$G114))","v":""},{"$f":"IF(AND(Mardi!$D114=\"\",Mardi!$G114=\"\"),\"\",IF(Mardi!$D114=\"Récréation\",CONCATENATE(Mardi!$A114&\" / \"&Mardi!$B114)&CHAR(10)&\"RECREATION\",CONCATENATE(Mardi!$A114&\" / \"&Mardi!$B114)&CHAR(10)&\"Matière : \"&Mardi!$D114&CHAR(10)&\"Compétences : \"&Mardi!$G114))","v":""},{"$f":"IF(AND(Mercredi!$D114=\"\",Mercredi!$G114=\"\"),\"\",IF(Mercredi!$D114=\"Récréation\",CONCATENATE(Mercredi!$A114&\" / \"&Mercredi!$B114)&CHAR(10)&\"RECREATION\",CONCATENATE(Mercredi!$A114&\" / \"&Mercredi!$B114)&CHAR(10)&\"Matière : \"&Mercredi!$D114&CHAR(10)&\"Compétences : \"&Mercredi!$G114))","v":""},{"$f":"IF(AND(Jeudi!$D114=\"\",Jeudi!$G114=\"\"),\"\",IF(Jeudi!$D114=\"Récréation\",CONCATENATE(Jeudi!$A114&\" / \"&Jeudi!$B114)&CHAR(10)&\"RECREATION\",CONCATENATE(Jeudi!$A114&\" / \"&Jeudi!$B114)&CHAR(10)&\"Matière : \"&Jeudi!$D114&CHAR(10)&\"Compétences : \"&Jeudi!$G114))","v":""},{"$f":"IF(AND(Vendredi!$D114=\"\",Vendredi!$G114=\"\"),\"\",IF(Vendredi!$D114=\"Récréation\",CONCATENATE(Vendredi!$A114&\" / \"&Vendredi!$B114)&CHAR(10)&\"RECREATION\",CONCATENATE(Vendredi!$A114&\" / \"&Vendredi!$B114)&CHAR(10)&\"Matière : \"&Vendredi!$D114&CHAR(10)&\"Compétences : \"&Vendredi!$G114))","v":""}]
[{"$f":"IF(AND(Lundi!$D115=\"\",Lundi!$G115=\"\"),\"\",IF(Lundi!$D115=\"Récréation\",CONCATENATE(Lundi!A115&\" / \"&Lundi!B115)&CHAR(10)&\"RECREATION\",CONCATENATE(Lundi!A115&\" / \"&Lundi!B115)&CHAR(10)&\"Matière : \"&Lundi!$D115&CHAR(10)&\"Compétences : \"&Lundi!$G115))","v":""},{"$f":"IF(AND(Mardi!$D115=\"\",Mardi!$G115=\"\"),\"\",IF(Mardi!$D115=\"Récréation\",CONCATENATE(Mardi!$A115&\" / \"&Mardi!$B115)&CHAR(10)&\"RECREATION\",CONCATENATE(Mardi!$A115&\" / \"&Mardi!$B115)&CHAR(10)&\"Matière : \"&Mardi!$D115&CHAR(10)&\"Compétences : \"&Mardi!$G115))","v":""},{"$f":"IF(AND(Mercredi!$D115=\"\",Mercredi!$G115=\"\"),\"\",IF(Mercredi!$D115=\"Récréation\",CONCATENATE(Mercredi!$A115&\" / \"&Mercredi!$B115)&CHAR(10)&\"RECREATION\",CONCATENATE(Mercredi!$A115&\" / \"&Mercredi!$B115)&CHAR(10)&\"Matière : \"&Mercredi!$D115&CHAR(10)&\"Compétences : \"&Mercredi!$G115))","v":""},{"$f":"IF(AND(Jeudi!$D115=\"\",Jeudi!$G115=\"\"),\"\",IF(Jeudi!$D115=\"Récréation\",CONCATENATE(Jeudi!$A115&\" / \"&Jeudi!$B115)&CHAR(10)&\"RECREATION\",CONCATENATE(Jeudi!$A115&\" / \"&Jeudi!$B115)&CHAR(10)&\"Matière : \"&Jeudi!$D115&CHAR(10)&\"Compétences : \"&Jeudi!$G115))","v":""},{"$f":"IF(AND(Vendredi!$D115=\"\",Vendredi!$G115=\"\"),\"\",IF(Vendredi!$D115=\"Récréation\",CONCATENATE(Vendredi!$A115&\" / \"&Vendredi!$B115)&CHAR(10)&\"RECREATION\",CONCATENATE(Vendredi!$A115&\" / \"&Vendredi!$B115)&CHAR(10)&\"Matière : \"&Vendredi!$D115&CHAR(10)&\"Compétences : \"&Vendredi!$G115))","v":""}]
[{"$f":"IF(AND(Lundi!$D116=\"\",Lundi!$G116=\"\"),\"\",IF(Lundi!$D116=\"Récréation\",CONCATENATE(Lundi!A116&\" / \"&Lundi!B116)&CHAR(10)&\"RECREATION\",CONCATENATE(Lundi!A116&\" / \"&Lundi!B116)&CHAR(10)&\"Matière : \"&Lundi!$D116&CHAR(10)&\"Compétences : \"&Lundi!$G116))","v":""},{"$f":"IF(AND(Mardi!$D116=\"\",Mardi!$G116=\"\"),\"\",IF(Mardi!$D116=\"Récréation\",CONCATENATE(Mardi!$A116&\" / \"&Mardi!$B116)&CHAR(10)&\"RECREATION\",CONCATENATE(Mardi!$A116&\" / \"&Mardi!$B116)&CHAR(10)&\"Matière : \"&Mardi!$D116&CHAR(10)&\"Compétences : \"&Mardi!$G116))","v":""},{"$f":"IF(AND(Mercredi!$D116=\"\",Mercredi!$G116=\"\"),\"\",IF(Mercredi!$D116=\"Récréation\",CONCATENATE(Mercredi!$A116&\" / \"&Mercredi!$B116)&CHAR(10)&\"RECREATION\",CONCATENATE(Mercredi!$A116&\" / \"&Mercredi!$B116)&CHAR(10)&\"Matière : \"&Mercredi!$D116&CHAR(10)&\"Compétences : \"&Mercredi!$G116))","v":""},{"$f":"IF(AND(Jeudi!$D116=\"\",Jeudi!$G116=\"\"),\"\",IF(Jeudi!$D116=\"Récréation\",CONCATENATE(Jeudi!$A116&\" / \"&Jeudi!$B116)&CHAR(10)&\"RECREATION\",CONCATENATE(Jeudi!$A116&\" / \"&Jeudi!$B116)&CHAR(10)&\"Matière : \"&Jeudi!$D116&CHAR(10)&\"Compétences : \"&Jeudi!$G116))","v":""},{"$f":"IF(AND(Vendredi!$D116=\"\",Vendredi!$G116=\"\"),\"\",IF(Vendredi!$D116=\"Récréation\",CONCATENATE(Vendredi!$A116&\" / \"&Vendredi!$B116)&CHAR(10)&\"RECREATION\",CONCATENATE(Vendredi!$A116&\" / \"&Vendredi!$B116)&CHAR(10)&\"Matière : \"&Vendredi!$D116&CHAR(10)&\"Compétences : \"&Vendredi!$G116))","v":""}]
[{"$f":"IF(AND(Lundi!$D117=\"\",Lundi!$G117=\"\"),\"\",IF(Lundi!$D117=\"Récréation\",CONCATENATE(Lundi!A117&\" / \"&Lundi!B117)&CHAR(10)&\"RECREATION\",CONCATENATE(Lundi!A117&\" / \"&Lundi!B117)&CHAR(10)&\"Matière : \"&Lundi!$D117&CHAR(10)&\"Compétences : \"&Lundi!$G117))","v":""},{"$f":"IF(AND(Mardi!$D117=\"\",Mardi!$G117=\"\"),\"\",IF(Mardi!$D117=\"Récréation\",CONCATENATE(Mardi!$A117&\" / \"&Mardi!$B117)&CHAR(10)&\"RECREATION\",CONCATENATE(Mardi!$A117&\" / \"&Mardi!$B117)&CHAR(10)&\"Matière : \"&Mardi!$D117&CHAR(10)&\"Compétences : \"&Mardi!$G117))","v":""},{"$f":"IF(AND(Mercredi!$D117=\"\",Mercredi!$G117=\"\"),\"\",IF(Mercredi!$D117=\"Récréation\",CONCATENATE(Mercredi!$A117&\" / \"&Mercredi!$B117)&CHAR(10)&\"RECREATION\",CONCATENATE(Mercredi!$A117&\" / \"&Mercredi!$B117)&CHAR(10)&\"Matière : \"&Mercredi!$D117&CHAR(10)&\"Compétences : \"&Mercredi!$G117))","v":""},{"$f":"IF(AND(Jeudi!$D117=\"\",Jeudi!$G117=\"\"),\"\",IF(Jeudi!$D117=\"Récréation\",CONCATENATE(Jeudi!$A117&\" / \"&Jeudi!$B117)&CHAR(10)&\"RECREATION\",CONCATENATE(Jeudi!$A117&\" / \"&Jeudi!$B117)&CHAR(10)&\"Matière : \"&Jeudi!$D117&CHAR(10)&\"Compétences : \"&Jeudi!$G117))","v":""},{"$f":"IF(AND(Vendredi!$D117=\"\",Vendredi!$G117=\"\"),\"\",IF(Vendredi!$D117=\"Récréation\",CONCATENATE(Vendredi!$A117&\" / \"&Vendredi!$B117)&CHAR(10)&\"RECREATION\",CONCATENATE(Vendredi!$A117&\" / \"&Vendredi!$B117)&CHAR(10)&\"Matière : \"&Vendredi!$D117&CHAR(10)&\"Compétences : \"&Vendredi!$G117))","v":""}]
[{"$f":"IF(AND(Lundi!$D118=\"\",Lundi!$G118=\"\"),\"\",IF(Lundi!$D118=\"Récréation\",CONCATENATE(Lundi!A118&\" / \"&Lundi!B118)&CHAR(10)&\"RECREATION\",CONCATENATE(Lundi!A118&\" / \"&Lundi!B118)&CHAR(10)&\"Matière : \"&Lundi!$D118&CHAR(10)&\"Compétences : \"&Lundi!$G118))","v":""},{"$f":"IF(AND(Mardi!$D118=\"\",Mardi!$G118=\"\"),\"\",IF(Mardi!$D118=\"Récréation\",CONCATENATE(Mardi!$A118&\" / \"&Mardi!$B118)&CHAR(10)&\"RECREATION\",CONCATENATE(Mardi!$A118&\" / \"&Mardi!$B118)&CHAR(10)&\"Matière : \"&Mardi!$D118&CHAR(10)&\"Compétences : \"&Mardi!$G118))","v":""},{"$f":"IF(AND(Mercredi!$D118=\"\",Mercredi!$G118=\"\"),\"\",IF(Mercredi!$D118=\"Récréation\",CONCATENATE(Mercredi!$A118&\" / \"&Mercredi!$B118)&CHAR(10)&\"RECREATION\",CONCATENATE(Mercredi!$A118&\" / \"&Mercredi!$B118)&CHAR(10)&\"Matière : \"&Mercredi!$D118&CHAR(10)&\"Compétences : \"&Mercredi!$G118))","v":""},{"$f":"IF(AND(Jeudi!$D118=\"\",Jeudi!$G118=\"\"),\"\",IF(Jeudi!$D118=\"Récréation\",CONCATENATE(Jeudi!$A118&\" / \"&Jeudi!$B118)&CHAR(10)&\"RECREATION\",CONCATENATE(Jeudi!$A118&\" / \"&Jeudi!$B118)&CHAR(10)&\"Matière : \"&Jeudi!$D118&CHAR(10)&\"Compétences : \"&Jeudi!$G118))","v":""},{"$f":"IF(AND(Vendredi!$D118=\"\",Vendredi!$G118=\"\"),\"\",IF(Vendredi!$D118=\"Récréation\",CONCATENATE(Vendredi!$A118&\" / \"&Vendredi!$B118)&CHAR(10)&\"RECREATION\",CONCATENATE(Vendredi!$A118&\" / \"&Vendredi!$B118)&CHAR(10)&\"Matière : \"&Vendredi!$D118&CHAR(10)&\"Compétences : \"&Vendredi!$G118))","v":""}]
[{"$f":"IF(AND(Lundi!$D119=\"\",Lundi!$G119=\"\"),\"\",IF(Lundi!$D119=\"Récréation\",CONCATENATE(Lundi!A119&\" / \"&Lundi!B119)&CHAR(10)&\"RECREATION\",CONCATENATE(Lundi!A119&\" / \"&Lundi!B119)&CHAR(10)&\"Matière : \"&Lundi!$D119&CHAR(10)&\"Compétences : \"&Lundi!$G119))","v":""},{"$f":"IF(AND(Mardi!$D119=\"\",Mardi!$G119=\"\"),\"\",IF(Mardi!$D119=\"Récréation\",CONCATENATE(Mardi!$A119&\" / \"&Mardi!$B119)&CHAR(10)&\"RECREATION\",CONCATENATE(Mardi!$A119&\" / \"&Mardi!$B119)&CHAR(10)&\"Matière : \"&Mardi!$D119&CHAR(10)&\"Compétences : \"&Mardi!$G119))","v":""},{"$f":"IF(AND(Mercredi!$D119=\"\",Mercredi!$G119=\"\"),\"\",IF(Mercredi!$D119=\"Récréation\",CONCATENATE(Mercredi!$A119&\" / \"&Mercredi!$B119)&CHAR(10)&\"RECREATION\",CONCATENATE(Mercredi!$A119&\" / \"&Mercredi!$B119)&CHAR(10)&\"Matière : \"&Mercredi!$D119&CHAR(10)&\"Compétences : \"&Mercredi!$G119))","v":""},{"$f":"IF(AND(Jeudi!$D119=\"\",Jeudi!$G119=\"\"),\"\",IF(Jeudi!$D119=\"Récréation\",CONCATENATE(Jeudi!$A119&\" / \"&Jeudi!$B119)&CHAR(10)&\"RECREATION\",CONCATENATE(Jeudi!$A119&\" / \"&Jeudi!$B119)&CHAR(10)&\"Matière : \"&Jeudi!$D119&CHAR(10)&\"Compétences : \"&Jeudi!$G119))","v":""},{"$f":"IF(AND(Vendredi!$D119=\"\",Vendredi!$G119=\"\"),\"\",IF(Vendredi!$D119=\"Récréation\",CONCATENATE(Vendredi!$A119&\" / \"&Vendredi!$B119)&CHAR(10)&\"RECREATION\",CONCATENATE(Vendredi!$A119&\" / \"&Vendredi!$B119)&CHAR(10)&\"Matière : \"&Vendredi!$D119&CHAR(10)&\"Compétences : \"&Vendredi!$G119))","v":""}]
[{"$f":"IF(AND(Lundi!$D120=\"\",Lundi!$G120=\"\"),\"\",IF(Lundi!$D120=\"Récréation\",CONCATENATE(Lundi!A120&\" / \"&Lundi!B120)&CHAR(10)&\"RECREATION\",CONCATENATE(Lundi!A120&\" / \"&Lundi!B120)&CHAR(10)&\"Matière : \"&Lundi!$D120&CHAR(10)&\"Compétences : \"&Lundi!$G120))","v":""},{"$f":"IF(AND(Mardi!$D120=\"\",Mardi!$G120=\"\"),\"\",IF(Mardi!$D120=\"Récréation\",CONCATENATE(Mardi!$A120&\" / \"&Mardi!$B120)&CHAR(10)&\"RECREATION\",CONCATENATE(Mardi!$A120&\" / \"&Mardi!$B120)&CHAR(10)&\"Matière : \"&Mardi!$D120&CHAR(10)&\"Compétences : \"&Mardi!$G120))","v":""},{"$f":"IF(AND(Mercredi!$D120=\"\",Mercredi!$G120=\"\"),\"\",IF(Mercredi!$D120=\"Récréation\",CONCATENATE(Mercredi!$A120&\" / \"&Mercredi!$B120)&CHAR(10)&\"RECREATION\",CONCATENATE(Mercredi!$A120&\" / \"&Mercredi!$B120)&CHAR(10)&\"Matière : \"&Mercredi!$D120&CHAR(10)&\"Compétences : \"&Mercredi!$G120))","v":""},{"$f":"IF(AND(Jeudi!$D120=\"\",Jeudi!$G120=\"\"),\"\",IF(Jeudi!$D120=\"Récréation\",CONCATENATE(Jeudi!$A120&\" / \"&Jeudi!$B120)&CHAR(10)&\"RECREATION\",CONCATENATE(Jeudi!$A120&\" / \"&Jeudi!$B120)&CHAR(10)&\"Matière : \"&Jeudi!$D120&CHAR(10)&\"Compétences : \"&Jeudi!$G120))","v":""},{"$f":"IF(AND(Vendredi!$D120=\"\",Vendredi!$G120=\"\"),\"\",IF(Vendredi!$D120=\"Récréation\",CONCATENATE(Vendredi!$A120&\" / \"&Vendredi!$B120)&CHAR(10)&\"RECREATION\",CONCATENATE(Vendredi!$A120&\" / \"&Vendredi!$B120)&CHAR(10)&\"Matière : \"&Vendredi!$D120&CHAR(10)&\"Compétences : \"&Vendredi!$G120))","v":""}]
[{"$f":"IF(AND(Lundi!$D121=\"\",Lundi!$G121=\"\"),\"\",IF(Lundi!$D121=\"Récréation\",CONCATENATE(Lundi!A121&\" / \"&Lundi!B121)&CHAR(10)&\"RECREATION\",CONCATENATE(Lundi!A121&\" / \"&Lundi!B121)&CHAR(10)&\"Matière : \"&Lundi!$D121&CHAR(10)&\"Compétences : \"&Lundi!$G121))","v":""},{"$f":"IF(AND(Mardi!$D121=\"\",Mardi!$G121=\"\"),\"\",IF(Mardi!$D121=\"Récréation\",CONCATENATE(Mardi!$A121&\" / \"&Mardi!$B121)&CHAR(10)&\"RECREATION\",CONCATENATE(Mardi!$A121&\" / \"&Mardi!$B121)&CHAR(10)&\"Matière : \"&Mardi!$D121&CHAR(10)&\"Compétences : \"&Mardi!$G121))","v":""},{"$f":"IF(AND(Mercredi!$D121=\"\",Mercredi!$G121=\"\"),\"\",IF(Mercredi!$D121=\"Récréation\",CONCATENATE(Mercredi!$A121&\" / \"&Mercredi!$B121)&CHAR(10)&\"RECREATION\",CONCATENATE(Mercredi!$A121&\" / \"&Mercredi!$B121)&CHAR(10)&\"Matière : \"&Mercredi!$D121&CHAR(10)&\"Compétences : \"&Mercredi!$G121))","v":""},{"$f":"IF(AND(Jeudi!$D121=\"\",Jeudi!$G121=\"\"),\"\",IF(Jeudi!$D121=\"Récréation\",CONCATENATE(Jeudi!$A121&\" / \"&Jeudi!$B121)&CHAR(10)&\"RECREATION\",CONCATENATE(Jeudi!$A121&\" / \"&Jeudi!$B121)&CHAR(10)&\"Matière : \"&Jeudi!$D121&CHAR(10)&\"Compétences : \"&Jeudi!$G121))","v":""},{"$f":"IF(AND(Vendredi!$D121=\"\",Vendredi!$G121=\"\"),\"\",IF(Vendredi!$D121=\"Récréation\",CONCATENATE(Vendredi!$A121&\" / \"&Vendredi!$B121)&CHAR(10)&\"RECREATION\",CONCATENATE(Vendredi!$A121&\" / \"&Vendredi!$B121)&CHAR(10)&\"Matière : \"&Vendredi!$D121&CHAR(10)&\"Compétences : \"&Vendredi!$G121))","v":""}]
[{"$f":"IF(AND(Lundi!$D122=\"\",Lundi!$G122=\"\"),\"\",IF(Lundi!$D122=\"Récréation\",CONCATENATE(Lundi!A122&\" / \"&Lundi!B122)&CHAR(10)&\"RECREATION\",CONCATENATE(Lundi!A122&\" / \"&Lundi!B122)&CHAR(10)&\"Matière : \"&Lundi!$D122&CHAR(10)&\"Compétences : \"&Lundi!$G122))","v":""},{"$f":"IF(AND(Mardi!$D122=\"\",Mardi!$G122=\"\"),\"\",IF(Mardi!$D122=\"Récréation\",CONCATENATE(Mardi!$A122&\" / \"&Mardi!$B122)&CHAR(10)&\"RECREATION\",CONCATENATE(Mardi!$A122&\" / \"&Mardi!$B122)&CHAR(10)&\"Matière : \"&Mardi!$D122&CHAR(10)&\"Compétences : \"&Mardi!$G122))","v":""},{"$f":"IF(AND(Mercredi!$D122=\"\",Mercredi!$G122=\"\"),\"\",IF(Mercredi!$D122=\"Récréation\",CONCATENATE(Mercredi!$A122&\" / \"&Mercredi!$B122)&CHAR(10)&\"RECREATION\",CONCATENATE(Mercredi!$A122&\" / \"&Mercredi!$B122)&CHAR(10)&\"Matière : \"&Mercredi!$D122&CHAR(10)&\"Compétences : \"&Mercredi!$G122))","v":""},{"$f":"IF(AND(Jeudi!$D122=\"\",Jeudi!$G122=\"\"),\"\",IF(Jeudi!$D122=\"Récréation\",CONCATENATE(Jeudi!$A122&\" / \"&Jeudi!$B122)&CHAR(10)&\"RECREATION\",CONCATENATE(Jeudi!$A122&\" / \"&Jeudi!$B122)&CHAR(10)&\"Matière : \"&Jeudi!$D122&CHAR(10)&\"Compétences : \"&Jeudi!$G122))","v":""},{"$f":"IF(AND(Vendredi!$D122=\"\",Vendredi!$G122=\"\"),\"\",IF(Vendredi!$D122=\"Récréation\",CONCATENATE(Vendredi!$A122&\" / \"&Vendredi!$B122)&CHAR(10)&\"RECREATION\",CONCATENATE(Vendredi!$A122&\" / \"&Vendredi!$B122)&CHAR(10)&\"Matière : \"&Vendredi!$D122&CHAR(10)&\"Compétences : \"&Vendredi!$G122))","v":""}]
[{"$f":"IF(AND(Lundi!$D123=\"\",Lundi!$G123=\"\"),\"\",IF(Lundi!$D123=\"Récréation\",CONCATENATE(Lundi!A123&\" / \"&Lundi!B123)&CHAR(10)&\"RECREATION\",CONCATENATE(Lundi!A123&\" / \"&Lundi!B123)&CHAR(10)&\"Matière : \"&Lundi!$D123&CHAR(10)&\"Compétences : \"&Lundi!$G123))","v":""},{"$f":"IF(AND(Mardi!$D123=\"\",Mardi!$G123=\"\"),\"\",IF(Mardi!$D123=\"Récréation\",CONCATENATE(Mardi!$A123&\" / \"&Mardi!$B123)&CHAR(10)&\"RECREATION\",CONCATENATE(Mardi!$A123&\" / \"&Mardi!$B123)&CHAR(10)&\"Matière : \"&Mardi!$D123&CHAR(10)&\"Compétences : \"&Mardi!$G123))","v":""},{"$f":"IF(AND(Mercredi!$D123=\"\",Mercredi!$G123=\"\"),\"\",IF(Mercredi!$D123=\"Récréation\",CONCATENATE(Mercredi!$A123&\" / \"&Mercredi!$B123)&CHAR(10)&\"RECREATION\",CONCATENATE(Mercredi!$A123&\" / \"&Mercredi!$B123)&CHAR(10)&\"Matière : \"&Mercredi!$D123&CHAR(10)&\"Compétences : \"&Mercredi!$G123))","v":""},{"$f":"IF(AND(Jeudi!$D123=\"\",Jeudi!$G123=\"\"),\"\",IF(Jeudi!$D123=\"Récréation\",CONCATENATE(Jeudi!$A123&\" / \"&Jeudi!$B123)&CHAR(10)&\"RECREATION\",CONCATENATE(Jeudi!$A123&\" / \"&Jeudi!$B123)&CHAR(10)&\"Matière : \"&Jeudi!$D123&CHAR(10)&\"Compétences : \"&Jeudi!$G123))","v":""},{"$f":"IF(AND(Vendredi!$D123=\"\",Vendredi!$G123=\"\"),\"\",IF(Vendredi!$D123=\"Récréation\",CONCATENATE(Vendredi!$A123&\" / \"&Vendredi!$B123)&CHAR(10)&\"RECREATION\",CONCATENATE(Vendredi!$A123&\" / \"&Vendredi!$B123)&CHAR(10)&\"Matière : \"&Vendredi!$D123&CHAR(10)&\"Compétences : \"&Vendredi!$G123))","v":""}]
[{"$f":"IF(AND(Lundi!$D124=\"\",Lundi!$G124=\"\"),\"\",IF(Lundi!$D124=\"Récréation\",CONCATENATE(Lundi!A124&\" / \"&Lundi!B124)&CHAR(10)&\"RECREATION\",CONCATENATE(Lundi!A124&\" / \"&Lundi!B124)&CHAR(10)&\"Matière : \"&Lundi!$D124&CHAR(10)&\"Compétences : \"&Lundi!$G124))","v":""},{"$f":"IF(AND(Mardi!$D124=\"\",Mardi!$G124=\"\"),\"\",IF(Mardi!$D124=\"Récréation\",CONCATENATE(Mardi!$A124&\" / \"&Mardi!$B124)&CHAR(10)&\"RECREATION\",CONCATENATE(Mardi!$A124&\" / \"&Mardi!$B124)&CHAR(10)&\"Matière : \"&Mardi!$D124&CHAR(10)&\"Compétences : \"&Mardi!$G124))","v":""},{"$f":"IF(AND(Mercredi!$D124=\"\",Mercredi!$G124=\"\"),\"\",IF(Mercredi!$D124=\"Récréation\",CONCATENATE(Mercredi!$A124&\" / \"&Mercredi!$B124)&CHAR(10)&\"RECREATION\",CONCATENATE(Mercredi!$A124&\" / \"&Mercredi!$B124)&CHAR(10)&\"Matière : \"&Mercredi!$D124&CHAR(10)&\"Compétences : \"&Mercredi!$G124))","v":""},{"$f":"IF(AND(Jeudi!$D124=\"\",Jeudi!$G124=\"\"),\"\",IF(Jeudi!$D124=\"Récréation\",CONCATENATE(Jeudi!$A124&\" / \"&Jeudi!$B124)&CHAR(10)&\"RECREATION\",CONCATENATE(Jeudi!$A124&\" / \"&Jeudi!$B124)&CHAR(10)&\"Matière : \"&Jeudi!$D124&CHAR(10)&\"Compétences : \"&Jeudi!$G124))","v":""},{"$f":"IF(AND(Vendredi!$D124=\"\",Vendredi!$G124=\"\"),\"\",IF(Vendredi!$D124=\"Récréation\",CONCATENATE(Vendredi!$A124&\" / \"&Vendredi!$B124)&CHAR(10)&\"RECREATION\",CONCATENATE(Vendredi!$A124&\" / \"&Vendredi!$B124)&CHAR(10)&\"Matière : \"&Vendredi!$D124&CHAR(10)&\"Compétences : \"&Vendredi!$G124))","v":""}]
[{"$f":"IF(AND(Lundi!$D125=\"\",Lundi!$G125=\"\"),\"\",IF(Lundi!$D125=\"Récréation\",CONCATENATE(Lundi!A125&\" / \"&Lundi!B125)&CHAR(10)&\"RECREATION\",CONCATENATE(Lundi!A125&\" / \"&Lundi!B125)&CHAR(10)&\"Matière : \"&Lundi!$D125&CHAR(10)&\"Compétences : \"&Lundi!$G125))","v":""},{"$f":"IF(AND(Mardi!$D125=\"\",Mardi!$G125=\"\"),\"\",IF(Mardi!$D125=\"Récréation\",CONCATENATE(Mardi!$A125&\" / \"&Mardi!$B125)&CHAR(10)&\"RECREATION\",CONCATENATE(Mardi!$A125&\" / \"&Mardi!$B125)&CHAR(10)&\"Matière : \"&Mardi!$D125&CHAR(10)&\"Compétences : \"&Mardi!$G125))","v":""},{"$f":"IF(AND(Mercredi!$D125=\"\",Mercredi!$G125=\"\"),\"\",IF(Mercredi!$D125=\"Récréation\",CONCATENATE(Mercredi!$A125&\" / \"&Mercredi!$B125)&CHAR(10)&\"RECREATION\",CONCATENATE(Mercredi!$A125&\" / \"&Mercredi!$B125)&CHAR(10)&\"Matière : \"&Mercredi!$D125&CHAR(10)&\"Compétences : \"&Mercredi!$G125))","v":""},{"$f":"IF(AND(Jeudi!$D125=\"\",Jeudi!$G125=\"\"),\"\",IF(Jeudi!$D125=\"Récréation\",CONCATENATE(Jeudi!$A125&\" / \"&Jeudi!$B125)&CHAR(10)&\"RECREATION\",CONCATENATE(Jeudi!$A125&\" / \"&Jeudi!$B125)&CHAR(10)&\"Matière : \"&Jeudi!$D125&CHAR(10)&\"Compétences : \"&Jeudi!$G125))","v":""},{"$f":"IF(AND(Vendredi!$D125=\"\",Vendredi!$G125=\"\"),\"\",IF(Vendredi!$D125=\"Récréation\",CONCATENATE(Vendredi!$A125&\" / \"&Vendredi!$B125)&CHAR(10)&\"RECREATION\",CONCATENATE(Vendredi!$A125&\" / \"&Vendredi!$B125)&CHAR(10)&\"Matière : \"&Vendredi!$D125&CHAR(10)&\"Compétences : \"&Vendredi!$G125))","v":""}]
[{"$f":"IF(AND(Lundi!$D126=\"\",Lundi!$G126=\"\"),\"\",IF(Lundi!$D126=\"Récréation\",CONCATENATE(Lundi!A126&\" / \"&Lundi!B126)&CHAR(10)&\"RECREATION\",CONCATENATE(Lundi!A126&\" / \"&Lundi!B126)&CHAR(10)&\"Matière : \"&Lundi!$D126&CHAR(10)&\"Compétences : \"&Lundi!$G126))","v":""},{"$f":"IF(AND(Mardi!$D126=\"\",Mardi!$G126=\"\"),\"\",IF(Mardi!$D126=\"Récréation\",CONCATENATE(Mardi!$A126&\" / \"&Mardi!$B126)&CHAR(10)&\"RECREATION\",CONCATENATE(Mardi!$A126&\" / \"&Mardi!$B126)&CHAR(10)&\"Matière : \"&Mardi!$D126&CHAR(10)&\"Compétences : \"&Mardi!$G126))","v":""},{"$f":"IF(AND(Mercredi!$D126=\"\",Mercredi!$G126=\"\"),\"\",IF(Mercredi!$D126=\"Récréation\",CONCATENATE(Mercredi!$A126&\" / \"&Mercredi!$B126)&CHAR(10)&\"RECREATION\",CONCATENATE(Mercredi!$A126&\" / \"&Mercredi!$B126)&CHAR(10)&\"Matière : \"&Mercredi!$D126&CHAR(10)&\"Compétences : \"&Mercredi!$G126))","v":""},{"$f":"IF(AND(Jeudi!$D126=\"\",Jeudi!$G126=\"\"),\"\",IF(Jeudi!$D126=\"Récréation\",CONCATENATE(Jeudi!$A126&\" / \"&Jeudi!$B126)&CHAR(10)&\"RECREATION\",CONCATENATE(Jeudi!$A126&\" / \"&Jeudi!$B126)&CHAR(10)&\"Matière : \"&Jeudi!$D126&CHAR(10)&\"Compétences : \"&Jeudi!$G126))","v":""},{"$f":"IF(AND(Vendredi!$D126=\"\",Vendredi!$G126=\"\"),\"\",IF(Vendredi!$D126=\"Récréation\",CONCATENATE(Vendredi!$A126&\" / \"&Vendredi!$B126)&CHAR(10)&\"RECREATION\",CONCATENATE(Vendredi!$A126&\" / \"&Vendredi!$B126)&CHAR(10)&\"Matière : \"&Vendredi!$D126&CHAR(10)&\"Compétences : \"&Vendredi!$G126))","v":""}]
[{"$f":"IF(AND(Lundi!$D127=\"\",Lundi!$G127=\"\"),\"\",IF(Lundi!$D127=\"Récréation\",CONCATENATE(Lundi!A127&\" / \"&Lundi!B127)&CHAR(10)&\"RECREATION\",CONCATENATE(Lundi!A127&\" / \"&Lundi!B127)&CHAR(10)&\"Matière : \"&Lundi!$D127&CHAR(10)&\"Compétences : \"&Lundi!$G127))","v":""},{"$f":"IF(AND(Mardi!$D127=\"\",Mardi!$G127=\"\"),\"\",IF(Mardi!$D127=\"Récréation\",CONCATENATE(Mardi!$A127&\" / \"&Mardi!$B127)&CHAR(10)&\"RECREATION\",CONCATENATE(Mardi!$A127&\" / \"&Mardi!$B127)&CHAR(10)&\"Matière : \"&Mardi!$D127&CHAR(10)&\"Compétences : \"&Mardi!$G127))","v":""},{"$f":"IF(AND(Mercredi!$D127=\"\",Mercredi!$G127=\"\"),\"\",IF(Mercredi!$D127=\"Récréation\",CONCATENATE(Mercredi!$A127&\" / \"&Mercredi!$B127)&CHAR(10)&\"RECREATION\",CONCATENATE(Mercredi!$A127&\" / \"&Mercredi!$B127)&CHAR(10)&\"Matière : \"&Mercredi!$D127&CHAR(10)&\"Compétences : \"&Mercredi!$G127))","v":""},{"$f":"IF(AND(Jeudi!$D127=\"\",Jeudi!$G127=\"\"),\"\",IF(Jeudi!$D127=\"Récréation\",CONCATENATE(Jeudi!$A127&\" / \"&Jeudi!$B127)&CHAR(10)&\"RECREATION\",CONCATENATE(Jeudi!$A127&\" / \"&Jeudi!$B127)&CHAR(10)&\"Matière : \"&Jeudi!$D127&CHAR(10)&\"Compétences : \"&Jeudi!$G127))","v":""},{"$f":"IF(AND(Vendredi!$D127=\"\",Vendredi!$G127=\"\"),\"\",IF(Vendredi!$D127=\"Récréation\",CONCATENATE(Vendredi!$A127&\" / \"&Vendredi!$B127)&CHAR(10)&\"RECREATION\",CONCATENATE(Vendredi!$A127&\" / \"&Vendredi!$B127)&CHAR(10)&\"Matière : \"&Vendredi!$D127&CHAR(10)&\"Compétences : \"&Vendredi!$G127))","v":""}]
[{"$f":"IF(AND(Lundi!$D128=\"\",Lundi!$G128=\"\"),\"\",IF(Lundi!$D128=\"Récréation\",CONCATENATE(Lundi!A128&\" / \"&Lundi!B128)&CHAR(10)&\"RECREATION\",CONCATENATE(Lundi!A128&\" / \"&Lundi!B128)&CHAR(10)&\"Matière : \"&Lundi!$D128&CHAR(10)&\"Compétences : \"&Lundi!$G128))","v":""},{"$f":"IF(AND(Mardi!$D128=\"\",Mardi!$G128=\"\"),\"\",IF(Mardi!$D128=\"Récréation\",CONCATENATE(Mardi!$A128&\" / \"&Mardi!$B128)&CHAR(10)&\"RECREATION\",CONCATENATE(Mardi!$A128&\" / \"&Mardi!$B128)&CHAR(10)&\"Matière : \"&Mardi!$D128&CHAR(10)&\"Compétences : \"&Mardi!$G128))","v":""},{"$f":"IF(AND(Mercredi!$D128=\"\",Mercredi!$G128=\"\"),\"\",IF(Mercredi!$D128=\"Récréation\",CONCATENATE(Mercredi!$A128&\" / \"&Mercredi!$B128)&CHAR(10)&\"RECREATION\",CONCATENATE(Mercredi!$A128&\" / \"&Mercredi!$B128)&CHAR(10)&\"Matière : \"&Mercredi!$D128&CHAR(10)&\"Compétences : \"&Mercredi!$G128))","v":""},{"$f":"IF(AND(Jeudi!$D128=\"\",Jeudi!$G128=\"\"),\"\",IF(Jeudi!$D128=\"Récréation\",CONCATENATE(Jeudi!$A128&\" / \"&Jeudi!$B128)&CHAR(10)&\"RECREATION\",CONCATENATE(Jeudi!$A128&\" / \"&Jeudi!$B128)&CHAR(10)&\"Matière : \"&Jeudi!$D128&CHAR(10)&\"Compétences : \"&Jeudi!$G128))","v":""},{"$f":"IF(AND(Vendredi!$D128=\"\",Vendredi!$G128=\"\"),\"\",IF(Vendredi!$D128=\"Récréation\",CONCATENATE(Vendredi!$A128&\" / \"&Vendredi!$B128)&CHAR(10)&\"RECREATION\",CONCATENATE(Vendredi!$A128&\" / \"&Vendredi!$B128)&CHAR(10)&\"Matière : \"&Vendredi!$D128&CHAR(10)&\"Compétences : \"&Vendredi!$G128))","v":""}]
[{"$f":"IF(AND(Lundi!$D129=\"\",Lundi!$G129=\"\"),\"\",IF(Lundi!$D129=\"Récréation\",CONCATENATE(Lundi!A129&\" / \"&Lundi!B129)&CHAR(10)&\"RECREATION\",CONCATENATE(Lundi!A129&\" / \"&Lundi!B129)&CHAR(10)&\"Matière : \"&Lundi!$D129&CHAR(10)&\"Compétences : \"&Lundi!$G129))","v":""},{"$f":"IF(AND(Mardi!$D129=\"\",Mardi!$G129=\"\"),\"\",IF(Mardi!$D129=\"Récréation\",CONCATENATE(Mardi!$A129&\" / \"&Mardi!$B129)&CHAR(10)&\"RECREATION\",CONCATENATE(Mardi!$A129&\" / \"&Mardi!$B129)&CHAR(10)&\"Matière : \"&Mardi!$D129&CHAR(10)&\"Compétences : \"&Mardi!$G129))","v":""},{"$f":"IF(AND(Mercredi!$D129=\"\",Mercredi!$G129=\"\"),\"\",IF(Mercredi!$D129=\"Récréation\",CONCATENATE(Mercredi!$A129&\" / \"&Mercredi!$B129)&CHAR(10)&\"RECREATION\",CONCATENATE(Mercredi!$A129&\" / \"&Mercredi!$B129)&CHAR(10)&\"Matière : \"&Mercredi!$D129&CHAR(10)&\"Compétences : \"&Mercredi!$G129))","v":""},{"$f":"IF(AND(Jeudi!$D129=\"\",Jeudi!$G129=\"\"),\"\",IF(Jeudi!$D129=\"Récréation\",CONCATENATE(Jeudi!$A129&\" / \"&Jeudi!$B129)&CHAR(10)&\"RECREATION\",CONCATENATE(Jeudi!$A129&\" / \"&Jeudi!$B129)&CHAR(10)&\"Matière : \"&Jeudi!$D129&CHAR(10)&\"Compétences : \"&Jeudi!$G129))","v":""},{"$f":"IF(AND(Vendredi!$D129=\"\",Vendredi!$G129=\"\"),\"\",IF(Vendredi!$D129=\"Récréation\",CONCATENATE(Vendredi!$A129&\" / \"&Vendredi!$B129)&CHAR(10)&\"RECREATION\",CONCATENATE(Vendredi!$A129&\" / \"&Vendredi!$B129)&CHAR(10)&\"Matière : \"&Vendredi!$D129&CHAR(10)&\"Compétences : \"&Vendredi!$G129))","v":""}]
[{"$f":"IF(AND(Lundi!$D130=\"\",Lundi!$G130=\"\"),\"\",IF(Lundi!$D130=\"Récréation\",CONCATENATE(Lundi!A130&\" / \"&Lundi!B130)&CHAR(10)&\"RECREATION\",CONCATENATE(Lundi!A130&\" / \"&Lundi!B130)&CHAR(10)&\"Matière : \"&Lundi!$D130&CHAR(10)&\"Compétences : \"&Lundi!$G130))","v":""},{"$f":"IF(AND(Mardi!$D130=\"\",Mardi!$G130=\"\"),\"\",IF(Mardi!$D130=\"Récréation\",CONCATENATE(Mardi!$A130&\" / \"&Mardi!$B130)&CHAR(10)&\"RECREATION\",CONCATENATE(Mardi!$A130&\" / \"&Mardi!$B130)&CHAR(10)&\"Matière : \"&Mardi!$D130&CHAR(10)&\"Compétences : \"&Mardi!$G130))","v":""},{"$f":"IF(AND(Mercredi!$D130=\"\",Mercredi!$G130=\"\"),\"\",IF(Mercredi!$D130=\"Récréation\",CONCATENATE(Mercredi!$A130&\" / \"&Mercredi!$B130)&CHAR(10)&\"RECREATION\",CONCATENATE(Mercredi!$A130&\" / \"&Mercredi!$B130)&CHAR(10)&\"Matière : \"&Mercredi!$D130&CHAR(10)&\"Compétences : \"&Mercredi!$G130))","v":""},{"$f":"IF(AND(Jeudi!$D130=\"\",Jeudi!$G130=\"\"),\"\",IF(Jeudi!$D130=\"Récréation\",CONCATENATE(Jeudi!$A130&\" / \"&Jeudi!$B130)&CHAR(10)&\"RECREATION\",CONCATENATE(Jeudi!$A130&\" / \"&Jeudi!$B130)&CHAR(10)&\"Matière : \"&Jeudi!$D130&CHAR(10)&\"Compétences : \"&Jeudi!$G130))","v":""},{"$f":"IF(AND(Vendredi!$D130=\"\",Vendredi!$G130=\"\"),\"\",IF(Vendredi!$D130=\"Récréation\",CONCATENATE(Vendredi!$A130&\" / \"&Vendredi!$B130)&CHAR(10)&\"RECREATION\",CONCATENATE(Vendredi!$A130&\" / \"&Vendredi!$B130)&CHAR(10)&\"Matière : \"&Vendredi!$D130&CHAR(10)&\"Compétences : \"&Vendredi!$G130))","v":""}]
[{"$f":"IF(AND(Lundi!$D131=\"\",Lundi!$G131=\"\"),\"\",IF(Lundi!$D131=\"Récréation\",CONCATENATE(Lundi!A131&\" / \"&Lundi!B131)&CHAR(10)&\"RECREATION\",CONCATENATE(Lundi!A131&\" / \"&Lundi!B131)&CHAR(10)&\"Matière : \"&Lundi!$D131&CHAR(10)&\"Compétences : \"&Lundi!$G131))","v":""},{"$f":"IF(AND(Mardi!$D131=\"\",Mardi!$G131=\"\"),\"\",IF(Mardi!$D131=\"Récréation\",CONCATENATE(Mardi!$A131&\" / \"&Mardi!$B131)&CHAR(10)&\"RECREATION\",CONCATENATE(Mardi!$A131&\" / \"&Mardi!$B131)&CHAR(10)&\"Matière : \"&Mardi!$D131&CHAR(10)&\"Compétences : \"&Mardi!$G131))","v":""},{"$f":"IF(AND(Mercredi!$D131=\"\",Mercredi!$G131=\"\"),\"\",IF(Mercredi!$D131=\"Récréation\",CONCATENATE(Mercredi!$A131&\" / \"&Mercredi!$B131)&CHAR(10)&\"RECREATION\",CONCATENATE(Mercredi!$A131&\" / \"&Mercredi!$B131)&CHAR(10)&\"Matière : \"&Mercredi!$D131&CHAR(10)&\"Compétences : \"&Mercredi!$G131))","v":""},{"$f":"IF(AND(Jeudi!$D131=\"\",Jeudi!$G131=\"\"),\"\",IF(Jeudi!$D131=\"Récréation\",CONCATENATE(Jeudi!$A131&\" / \"&Jeudi!$B131)&CHAR(10)&\"RECREATION\",CONCATENATE(Jeudi!$A131&\" / \"&Jeudi!$B131)&CHAR(10)&\"Matière : \"&Jeudi!$D131&CHAR(10)&\"Compétences : \"&Jeudi!$G131))","v":""},{"$f":"IF(AND(Vendredi!$D131=\"\",Vendredi!$G131=\"\"),\"\",IF(Vendredi!$D131=\"Récréation\",CONCATENATE(Vendredi!$A131&\" / \"&Vendredi!$B131)&CHAR(10)&\"RECREATION\",CONCATENATE(Vendredi!$A131&\" / \"&Vendredi!$B131)&CHAR(10)&\"Matière : \"&Vendredi!$D131&CHAR(10)&\"Compétences : \"&Vendredi!$G131))","v":""}]
[{"$f":"IF(AND(Lundi!$D132=\"\",Lundi!$G132=\"\"),\"\",IF(Lundi!$D132=\"Récréation\",CONCATENATE(Lundi!A132&\" / \"&Lundi!B132)&CHAR(10)&\"RECREATION\",CONCATENATE(Lundi!A132&\" / \"&Lundi!B132)&CHAR(10)&\"Matière : \"&Lundi!$D132&CHAR(10)&\"Compétences : \"&Lundi!$G132))","v":""},{"$f":"IF(AND(Mardi!$D132=\"\",Mardi!$G132=\"\"),\"\",IF(Mardi!$D132=\"Récréation\",CONCATENATE(Mardi!$A132&\" / \"&Mardi!$B132)&CHAR(10)&\"RECREATION\",CONCATENATE(Mardi!$A132&\" / \"&Mardi!$B132)&CHAR(10)&\"Matière : \"&Mardi!$D132&CHAR(10)&\"Compétences : \"&Mardi!$G132))","v":""},{"$f":"IF(AND(Mercredi!$D132=\"\",Mercredi!$G132=\"\"),\"\",IF(Mercredi!$D132=\"Récréation\",CONCATENATE(Mercredi!$A132&\" / \"&Mercredi!$B132)&CHAR(10)&\"RECREATION\",CONCATENATE(Mercredi!$A132&\" / \"&Mercredi!$B132)&CHAR(10)&\"Matière : \"&Mercredi!$D132&CHAR(10)&\"Compétences : \"&Mercredi!$G132))","v":""},{"$f":"IF(AND(Jeudi!$D132=\"\",Jeudi!$G132=\"\"),\"\",IF(Jeudi!$D132=\"Récréation\",CONCATENATE(Jeudi!$A132&\" / \"&Jeudi!$B132)&CHAR(10)&\"RECREATION\",CONCATENATE(Jeudi!$A132&\" / \"&Jeudi!$B132)&CHAR(10)&\"Matière : \"&Jeudi!$D132&CHAR(10)&\"Compétences : \"&Jeudi!$G132))","v":""},{"$f":"IF(AND(Vendredi!$D132=\"\",Vendredi!$G132=\"\"),\"\",IF(Vendredi!$D132=\"Récréation\",CONCATENATE(Vendredi!$A132&\" / \"&Vendredi!$B132)&CHAR(10)&\"RECREATION\",CONCATENATE(Vendredi!$A132&\" / \"&Vendredi!$B132)&CHAR(10)&\"Matière : \"&Vendredi!$D132&CHAR(10)&\"Compétences : \"&Vendredi!$G132))","v":""}]
[{"$f":"IF(AND(Lundi!$D133=\"\",Lundi!$G133=\"\"),\"\",IF(Lundi!$D133=\"Récréation\",CONCATENATE(Lundi!A133&\" / \"&Lundi!B133)&CHAR(10)&\"RECREATION\",CONCATENATE(Lundi!A133&\" / \"&Lundi!B133)&CHAR(10)&\"Matière : \"&Lundi!$D133&CHAR(10)&\"Compétences : \"&Lundi!$G133))","v":""},{"$f":"IF(AND(Mardi!$D133=\"\",Mardi!$G133=\"\"),\"\",IF(Mardi!$D133=\"Récréation\",CONCATENATE(Mardi!$A133&\" / \"&Mardi!$B133)&CHAR(10)&\"RECREATION\",CONCATENATE(Mardi!$A133&\" / \"&Mardi!$B133)&CHAR(10)&\"Matière : \"&Mardi!$D133&CHAR(10)&\"Compétences : \"&Mardi!$G133))","v":""},{"$f":"IF(AND(Mercredi!$D133=\"\",Mercredi!$G133=\"\"),\"\",IF(Mercredi!$D133=\"Récréation\",CONCATENATE(Mercredi!$A133&\" / \"&Mercredi!$B133)&CHAR(10)&\"RECREATION\",CONCATENATE(Mercredi!$A133&\" / \"&Mercredi!$B133)&CHAR(10)&\"Matière : \"&Mercredi!$D133&CHAR(10)&\"Compétences : \"&Mercredi!$G133))","v":""},{"$f":"IF(AND(Jeudi!$D133=\"\",Jeudi!$G133=\"\"),\"\",IF(Jeudi!$D133=\"Récréation\",CONCATENATE(Jeudi!$A133&\" / \"&Jeudi!$B133)&CHAR(10)&\"RECREATION\",CONCATENATE(Jeudi!$A133&\" / \"&Jeudi!$B133)&CHAR(10)&\"Matière : \"&Jeudi!$D133&CHAR(10)&\"Compétences : \"&Jeudi!$G133))","v":""},{"$f":"IF(AND(Vendredi!$D133=\"\",Vendredi!$G133=\"\"),\"\",IF(Vendredi!$D133=\"Récréation\",CONCATENATE(Vendredi!$A133&\" / \"&Vendredi!$B133)&CHAR(10)&\"RECREATION\",CONCATENATE(Vendredi!$A133&\" / \"&Vendredi!$B133)&CHAR(10)&\"Matière : \"&Vendredi!$D133&CHAR(10)&\"Compétences : \"&Vendredi!$G133))","v":""}]
[{"$f":"IF(AND(Lundi!$D134=\"\",Lundi!$G134=\"\"),\"\",IF(Lundi!$D134=\"Récréation\",CONCATENATE(Lundi!A134&\" / \"&Lundi!B134)&CHAR(10)&\"RECREATION\",CONCATENATE(Lundi!A134&\" / \"&Lundi!B134)&CHAR(10)&\"Matière : \"&Lundi!$D134&CHAR(10)&\"Compétences : \"&Lundi!$G134))","v":""},{"$f":"IF(AND(Mardi!$D134=\"\",Mardi!$G134=\"\"),\"\",IF(Mardi!$D134=\"Récréation\",CONCATENATE(Mardi!$A134&\" / \"&Mardi!$B134)&CHAR(10)&\"RECREATION\",CONCATENATE(Mardi!$A134&\" / \"&Mardi!$B134)&CHAR(10)&\"Matière : \"&Mardi!$D134&CHAR(10)&\"Compétences : \"&Mardi!$G134))","v":""},{"$f":"IF(AND(Mercredi!$D134=\"\",Mercredi!$G134=\"\"),\"\",IF(Mercredi!$D134=\"Récréation\",CONCATENATE(Mercredi!$A134&\" / \"&Mercredi!$B134)&CHAR(10)&\"RECREATION\",CONCATENATE(Mercredi!$A134&\" / \"&Mercredi!$B134)&CHAR(10)&\"Matière : \"&Mercredi!$D134&CHAR(10)&\"Compétences : \"&Mercredi!$G134))","v":""},{"$f":"IF(AND(Jeudi!$D134=\"\",Jeudi!$G134=\"\"),\"\",IF(Jeudi!$D134=\"Récréation\",CONCATENATE(Jeudi!$A134&\" / \"&Jeudi!$B134)&CHAR(10)&\"RECREATION\",CONCATENATE(Jeudi!$A134&\" / \"&Jeudi!$B134)&CHAR(10)&\"Matière : \"&Jeudi!$D134&CHAR(10)&\"Compétences : \"&Jeudi!$G134))","v":""},{"$f":"IF(AND(Vendredi!$D134=\"\",Vendredi!$G134=\"\"),\"\",IF(Vendredi!$D134=\"Récréation\",CONCATENATE(Vendredi!$A134&\" / \"&Vendredi!$B134)&CHAR(10)&\"RECREATION\",CONCATENATE(Vendredi!$A134&\" / \"&Vendredi!$B134)&CHAR(10)&\"Matière : \"&Vendredi!$D134&CHAR(10)&\"Compétences : \"&Vendredi!$G134))","v":""}]
[{"$f":"IF(AND(Lundi!$D135=\"\",Lundi!$G135=\"\"),\"\",IF(Lundi!$D135=\"Récréation\",CONCATENATE(Lundi!A135&\" / \"&Lundi!B135)&CHAR(10)&\"RECREATION\",CONCATENATE(Lundi!A135&\" / \"&Lundi!B135)&CHAR(10)&\"Matière : \"&Lundi!$D135&CHAR(10)&\"Compétences : \"&Lundi!$G135))","v":""},{"$f":"IF(AND(Mardi!$D135=\"\",Mardi!$G135=\"\"),\"\",IF(Mardi!$D135=\"Récréation\",CONCATENATE(Mardi!$A135&\" / \"&Mardi!$B135)&CHAR(10)&\"RECREATION\",CONCATENATE(Mardi!$A135&\" / \"&Mardi!$B135)&CHAR(10)&\"Matière : \"&Mardi!$D135&CHAR(10)&\"Compétences : \"&Mardi!$G135))","v":""},{"$f":"IF(AND(Mercredi!$D135=\"\",Mercredi!$G135=\"\"),\"\",IF(Mercredi!$D135=\"Récréation\",CONCATENATE(Mercredi!$A135&\" / \"&Mercredi!$B135)&CHAR(10)&\"RECREATION\",CONCATENATE(Mercredi!$A135&\" / \"&Mercredi!$B135)&CHAR(10)&\"Matière : \"&Mercredi!$D135&CHAR(10)&\"Compétences : \"&Mercredi!$G135))","v":""},{"$f":"IF(AND(Jeudi!$D135=\"\",Jeudi!$G135=\"\"),\"\",IF(Jeudi!$D135=\"Récréation\",CONCATENATE(Jeudi!$A135&\" / \"&Jeudi!$B135)&CHAR(10)&\"RECREATION\",CONCATENATE(Jeudi!$A135&\" / \"&Jeudi!$B135)&CHAR(10)&\"Matière : \"&Jeudi!$D135&CHAR(10)&\"Compétences : \"&Jeudi!$G135))","v":""},{"$f":"IF(AND(Vendredi!$D135=\"\",Vendredi!$G135=\"\"),\"\",IF(Vendredi!$D135=\"Récréation\",CONCATENATE(Vendredi!$A135&\" / \"&Vendredi!$B135)&CHAR(10)&\"RECREATION\",CONCATENATE(Vendredi!$A135&\" / \"&Vendredi!$B135)&CHAR(10)&\"Matière : \"&Vendredi!$D135&CHAR(10)&\"Compétences : \"&Vendredi!$G135))","v":""}]
[{"$f":"IF(AND(Lundi!$D136=\"\",Lundi!$G136=\"\"),\"\",IF(Lundi!$D136=\"Récréation\",CONCATENATE(Lundi!A136&\" / \"&Lundi!B136)&CHAR(10)&\"RECREATION\",CONCATENATE(Lundi!A136&\" / \"&Lundi!B136)&CHAR(10)&\"Matière : \"&Lundi!$D136&CHAR(10)&\"Compétences : \"&Lundi!$G136))","v":""},{"$f":"IF(AND(Mardi!$D136=\"\",Mardi!$G136=\"\"),\"\",IF(Mardi!$D136=\"Récréation\",CONCATENATE(Mardi!$A136&\" / \"&Mardi!$B136)&CHAR(10)&\"RECREATION\",CONCATENATE(Mardi!$A136&\" / \"&Mardi!$B136)&CHAR(10)&\"Matière : \"&Mardi!$D136&CHAR(10)&\"Compétences : \"&Mardi!$G136))","v":""},{"$f":"IF(AND(Mercredi!$D136=\"\",Mercredi!$G136=\"\"),\"\",IF(Mercredi!$D136=\"Récréation\",CONCATENATE(Mercredi!$A136&\" / \"&Mercredi!$B136)&CHAR(10)&\"RECREATION\",CONCATENATE(Mercredi!$A136&\" / \"&Mercredi!$B136)&CHAR(10)&\"Matière : \"&Mercredi!$D136&CHAR(10)&\"Compétences : \"&Mercredi!$G136))","v":""},{"$f":"IF(AND(Jeudi!$D136=\"\",Jeudi!$G136=\"\"),\"\",IF(Jeudi!$D136=\"Récréation\",CONCATENATE(Jeudi!$A136&\" / \"&Jeudi!$B136)&CHAR(10)&\"RECREATION\",CONCATENATE(Jeudi!$A136&\" / \"&Jeudi!$B136)&CHAR(10)&\"Matière : \"&Jeudi!$D136&CHAR(10)&\"Compétences : \"&Jeudi!$G136))","v":""},{"$f":"IF(AND(Vendredi!$D136=\"\",Vendredi!$G136=\"\"),\"\",IF(Vendredi!$D136=\"Récréation\",CONCATENATE(Vendredi!$A136&\" / \"&Vendredi!$B136)&CHAR(10)&\"RECREATION\",CONCATENATE(Vendredi!$A136&\" / \"&Vendredi!$B136)&CHAR(10)&\"Matière : \"&Vendredi!$D136&CHAR(10)&\"Compétences : \"&Vendredi!$G136))","v":""}]
[{"$f":"IF(AND(Lundi!$D137=\"\",Lundi!$G137=\"\"),\"\",IF(Lundi!$D137=\"Récréation\",CONCATENATE(Lundi!A137&\" / \"&Lundi!B137)&CHAR(10)&\"RECREATION\",CONCATENATE(Lundi!A137&\" / \"&Lundi!B137)&CHAR(10)&\"Matière : \"&Lundi!$D137&CHAR(10)&\"Compétences : \"&Lundi!$G137))","v":""},{"$f":"IF(AND(Mardi!$D137=\"\",Mardi!$G137=\"\"),\"\",IF(Mardi!$D137=\"Récréation\",CONCATENATE(Mardi!$A137&\" / \"&Mardi!$B137)&CHAR(10)&\"RECREATION\",CONCATENATE(Mardi!$A137&\" / \"&Mardi!$B137)&CHAR(10)&\"Matière : \"&Mardi!$D137&CHAR(10)&\"Compétences : \"&Mardi!$G137))","v":""},{"$f":"IF(AND(Mercredi!$D137=\"\",Mercredi!$G137=\"\"),\"\",IF(Mercredi!$D137=\"Récréation\",CONCATENATE(Mercredi!$A137&\" / \"&Mercredi!$B137)&CHAR(10)&\"RECREATION\",CONCATENATE(Mercredi!$A137&\" / \"&Mercredi!$B137)&CHAR(10)&\"Matière : \"&Mercredi!$D137&CHAR(10)&\"Compétences : \"&Mercredi!$G137))","v":""},{"$f":"IF(AND(Jeudi!$D137=\"\",Jeudi!$G137=\"\"),\"\",IF(Jeudi!$D137=\"Récréation\",CONCATENATE(Jeudi!$A137&\" / \"&Jeudi!$B137)&CHAR(10)&\"RECREATION\",CONCATENATE(Jeudi!$A137&\" / \"&Jeudi!$B137)&CHAR(10)&\"Matière : \"&Jeudi!$D137&CHAR(10)&\"Compétences : \"&Jeudi!$G137))","v":""},{"$f":"IF(AND(Vendredi!$D137=\"\",Vendredi!$G137=\"\"),\"\",IF(Vendredi!$D137=\"Récréation\",CONCATENATE(Vendredi!$A137&\" / \"&Vendredi!$B137)&CHAR(10)&\"RECREATION\",CONCATENATE(Vendredi!$A137&\" / \"&Vendredi!$B137)&CHAR(10)&\"Matière : \"&Vendredi!$D137&CHAR(10)&\"Compétences : \"&Vendredi!$G137))","v":""}]
[{"$f":"IF(AND(Lundi!$D138=\"\",Lundi!$G138=\"\"),\"\",IF(Lundi!$D138=\"Récréation\",CONCATENATE(Lundi!A138&\" / \"&Lundi!B138)&CHAR(10)&\"RECREATION\",CONCATENATE(Lundi!A138&\" / \"&Lundi!B138)&CHAR(10)&\"Matière : \"&Lundi!$D138&CHAR(10)&\"Compétences : \"&Lundi!$G138))","v":""},{"$f":"IF(AND(Mardi!$D138=\"\",Mardi!$G138=\"\"),\"\",IF(Mardi!$D138=\"Récréation\",CONCATENATE(Mardi!$A138&\" / \"&Mardi!$B138)&CHAR(10)&\"RECREATION\",CONCATENATE(Mardi!$A138&\" / \"&Mardi!$B138)&CHAR(10)&\"Matière : \"&Mardi!$D138&CHAR(10)&\"Compétences : \"&Mardi!$G138))","v":""},{"$f":"IF(AND(Mercredi!$D138=\"\",Mercredi!$G138=\"\"),\"\",IF(Mercredi!$D138=\"Récréation\",CONCATENATE(Mercredi!$A138&\" / \"&Mercredi!$B138)&CHAR(10)&\"RECREATION\",CONCATENATE(Mercredi!$A138&\" / \"&Mercredi!$B138)&CHAR(10)&\"Matière : \"&Mercredi!$D138&CHAR(10)&\"Compétences : \"&Mercredi!$G138))","v":""},{"$f":"IF(AND(Jeudi!$D138=\"\",Jeudi!$G138=\"\"),\"\",IF(Jeudi!$D138=\"Récréation\",CONCATENATE(Jeudi!$A138&\" / \"&Jeudi!$B138)&CHAR(10)&\"RECREATION\",CONCATENATE(Jeudi!$A138&\" / \"&Jeudi!$B138)&CHAR(10)&\"Matière : \"&Jeudi!$D138&CHAR(10)&\"Compétences : \"&Jeudi!$G138))","v":""},{"$f":"IF(AND(Vendredi!$D138=\"\",Vendredi!$G138=\"\"),\"\",IF(Vendredi!$D138=\"Récréation\",CONCATENATE(Vendredi!$A138&\" / \"&Vendredi!$B138)&CHAR(10)&\"RECREATION\",CONCATENATE(Vendredi!$A138&\" / \"&Vendredi!$B138)&CHAR(10)&\"Matière : \"&Vendredi!$D138&CHAR(10)&\"Compétences : \"&Vendredi!$G138))","v":""}]
[{"$f":"IF(AND(Lundi!$D139=\"\",Lundi!$G139=\"\"),\"\",IF(Lundi!$D139=\"Récréation\",CONCATENATE(Lundi!A139&\" / \"&Lundi!B139)&CHAR(10)&\"RECREATION\",CONCATENATE(Lundi!A139&\" / \"&Lundi!B139)&CHAR(10)&\"Matière : \"&Lundi!$D139&CHAR(10)&\"Compétences : \"&Lundi!$G139))","v":""},{"$f":"IF(AND(Mardi!$D139=\"\",Mardi!$G139=\"\"),\"\",IF(Mardi!$D139=\"Récréation\",CONCATENATE(Mardi!$A139&\" / \"&Mardi!$B139)&CHAR(10)&\"RECREATION\",CONCATENATE(Mardi!$A139&\" / \"&Mardi!$B139)&CHAR(10)&\"Matière : \"&Mardi!$D139&CHAR(10)&\"Compétences : \"&Mardi!$G139))","v":""},{"$f":"IF(AND(Mercredi!$D139=\"\",Mercredi!$G139=\"\"),\"\",IF(Mercredi!$D139=\"Récréation\",CONCATENATE(Mercredi!$A139&\" / \"&Mercredi!$B139)&CHAR(10)&\"RECREATION\",CONCATENATE(Mercredi!$A139&\" / \"&Mercredi!$B139)&CHAR(10)&\"Matière : \"&Mercredi!$D139&CHAR(10)&\"Compétences : \"&Mercredi!$G139))","v":""},{"$f":"IF(AND(Jeudi!$D139=\"\",Jeudi!$G139=\"\"),\"\",IF(Jeudi!$D139=\"Récréation\",CONCATENATE(Jeudi!$A139&\" / \"&Jeudi!$B139)&CHAR(10)&\"RECREATION\",CONCATENATE(Jeudi!$A139&\" / \"&Jeudi!$B139)&CHAR(10)&\"Matière : \"&Jeudi!$D139&CHAR(10)&\"Compétences : \"&Jeudi!$G139))","v":""},{"$f":"IF(AND(Vendredi!$D139=\"\",Vendredi!$G139=\"\"),\"\",IF(Vendredi!$D139=\"Récréation\",CONCATENATE(Vendredi!$A139&\" / \"&Vendredi!$B139)&CHAR(10)&\"RECREATION\",CONCATENATE(Vendredi!$A139&\" / \"&Vendredi!$B139)&CHAR(10)&\"Matière : \"&Vendredi!$D139&CHAR(10)&\"Compétences : \"&Vendredi!$G139))","v":""}]
[{"$f":"IF(AND(Lundi!$D140=\"\",Lundi!$G140=\"\"),\"\",IF(Lundi!$D140=\"Récréation\",CONCATENATE(Lundi!A140&\" / \"&Lundi!B140)&CHAR(10)&\"RECREATION\",CONCATENATE(Lundi!A140&\" / \"&Lundi!B140)&CHAR(10)&\"Matière : \"&Lundi!$D140&CHAR(10)&\"Compétences : \"&Lundi!$G140))","v":""},{"$f":"IF(AND(Mardi!$D140=\"\",Mardi!$G140=\"\"),\"\",IF(Mardi!$D140=\"Récréation\",CONCATENATE(Mardi!$A140&\" / \"&Mardi!$B140)&CHAR(10)&\"RECREATION\",CONCATENATE(Mardi!$A140&\" / \"&Mardi!$B140)&CHAR(10)&\"Matière : \"&Mardi!$D140&CHAR(10)&\"Compétences : \"&Mardi!$G140))","v":""},{"$f":"IF(AND(Mercredi!$D140=\"\",Mercredi!$G140=\"\"),\"\",IF(Mercredi!$D140=\"Récréation\",CONCATENATE(Mercredi!$A140&\" / \"&Mercredi!$B140)&CHAR(10)&\"RECREATION\",CONCATENATE(Mercredi!$A140&\" / \"&Mercredi!$B140)&CHAR(10)&\"Matière : \"&Mercredi!$D140&CHAR(10)&\"Compétences : \"&Mercredi!$G140))","v":""},{"$f":"IF(AND(Jeudi!$D140=\"\",Jeudi!$G140=\"\"),\"\",IF(Jeudi!$D140=\"Récréation\",CONCATENATE(Jeudi!$A140&\" / \"&Jeudi!$B140)&CHAR(10)&\"RECREATION\",CONCATENATE(Jeudi!$A140&\" / \"&Jeudi!$B140)&CHAR(10)&\"Matière : \"&Jeudi!$D140&CHAR(10)&\"Compétences : \"&Jeudi!$G140))","v":""},{"$f":"IF(AND(Vendredi!$D140=\"\",Vendredi!$G140=\"\"),\"\",IF(Vendredi!$D140=\"Récréation\",CONCATENATE(Vendredi!$A140&\" / \"&Vendredi!$B140)&CHAR(10)&\"RECREATION\",CONCATENATE(Vendredi!$A140&\" / \"&Vendredi!$B140)&CHAR(10)&\"Matière : \"&Vendredi!$D140&CHAR(10)&\"Compétences : \"&Vendredi!$G140))","v":""}]
[{"$f":"IF(AND(Lundi!$D141=\"\",Lundi!$G141=\"\"),\"\",IF(Lundi!$D141=\"Récréation\",CONCATENATE(Lundi!A141&\" / \"&Lundi!B141)&CHAR(10)&\"RECREATION\",CONCATENATE(Lundi!A141&\" / \"&Lundi!B141)&CHAR(10)&\"Matière : \"&Lundi!$D141&CHAR(10)&\"Compétences : \"&Lundi!$G141))","v":""},{"$f":"IF(AND(Mardi!$D141=\"\",Mardi!$G141=\"\"),\"\",IF(Mardi!$D141=\"Récréation\",CONCATENATE(Mardi!$A141&\" / \"&Mardi!$B141)&CHAR(10)&\"RECREATION\",CONCATENATE(Mardi!$A141&\" / \"&Mardi!$B141)&CHAR(10)&\"Matière : \"&Mardi!$D141&CHAR(10)&\"Compétences : \"&Mardi!$G141))","v":""},{"$f":"IF(AND(Mercredi!$D141=\"\",Mercredi!$G141=\"\"),\"\",IF(Mercredi!$D141=\"Récréation\",CONCATENATE(Mercredi!$A141&\" / \"&Mercredi!$B141)&CHAR(10)&\"RECREATION\",CONCATENATE(Mercredi!$A141&\" / \"&Mercredi!$B141)&CHAR(10)&\"Matière : \"&Mercredi!$D141&CHAR(10)&\"Compétences : \"&Mercredi!$G141))","v":""},{"$f":"IF(AND(Jeudi!$D141=\"\",Jeudi!$G141=\"\"),\"\",IF(Jeudi!$D141=\"Récréation\",CONCATENATE(Jeudi!$A141&\" / \"&Jeudi!$B141)&CHAR(10)&\"RECREATION\",CONCATENATE(Jeudi!$A141&\" / \"&Jeudi!$B141)&CHAR(10)&\"Matière : \"&Jeudi!$D141&CHAR(10)&\"Compétences : \"&Jeudi!$G141))","v":""},{"$f":"IF(AND(Vendredi!$D141=\"\",Vendredi!$G141=\"\"),\"\",IF(Vendredi!$D141=\"Récréation\",CONCATENATE(Vendredi!$A141&\" / \"&Vendredi!$B141)&CHAR(10)&\"RECREATION\",CONCATENATE(Vendredi!$A141&\" / \"&Vendredi!$B141)&CHAR(10)&\"Matière : \"&Vendredi!$D141&CHAR(10)&\"Compétences : \"&Vendredi!$G141))","v":""}]
[{"$f":"IF(AND(Lundi!$D142=\"\",Lundi!$G142=\"\"),\"\",IF(Lundi!$D142=\"Récréation\",CONCATENATE(Lundi!A142&\" / \"&Lundi!B142)&CHAR(10)&\"RECREATION\",CONCATENATE(Lundi!A142&\" / \"&Lundi!B142)&CHAR(10)&\"Matière : \"&Lundi!$D142&CHAR(10)&\"Compétences : \"&Lundi!$G142))","v":""},{"$f":"IF(AND(Mardi!$D142=\"\",Mardi!$G142=\"\"),\"\",IF(Mardi!$D142=\"Récréation\",CONCATENATE(Mardi!$A142&\" / \"&Mardi!$B142)&CHAR(10)&\"RECREATION\",CONCATENATE(Mardi!$A142&\" / \"&Mardi!$B142)&CHAR(10)&\"Matière : \"&Mardi!$D142&CHAR(10)&\"Compétences : \"&Mardi!$G142))","v":""},{"$f":"IF(AND(Mercredi!$D142=\"\",Mercredi!$G142=\"\"),\"\",IF(Mercredi!$D142=\"Récréation\",CONCATENATE(Mercredi!$A142&\" / \"&Mercredi!$B142)&CHAR(10)&\"RECREATION\",CONCATENATE(Mercredi!$A142&\" / \"&Mercredi!$B142)&CHAR(10)&\"Matière : \"&Mercredi!$D142&CHAR(10)&\"Compétences : \"&Mercredi!$G142))","v":""},{"$f":"IF(AND(Jeudi!$D142=\"\",Jeudi!$G142=\"\"),\"\",IF(Jeudi!$D142=\"Récréation\",CONCATENATE(Jeudi!$A142&\" / \"&Jeudi!$B142)&CHAR(10)&\"RECREATION\",CONCATENATE(Jeudi!$A142&\" / \"&Jeudi!$B142)&CHAR(10)&\"Matière : \"&Jeudi!$D142&CHAR(10)&\"Compétences : \"&Jeudi!$G142))","v":""},{"$f":"IF(AND(Vendredi!$D142=\"\",Vendredi!$G142=\"\"),\"\",IF(Vendredi!$D142=\"Récréation\",CONCATENATE(Vendredi!$A142&\" / \"&Vendredi!$B142)&CHAR(10)&\"RECREATION\",CONCATENATE(Vendredi!$A142&\" / \"&Vendredi!$B142)&CHAR(10)&\"Matière : \"&Vendredi!$D142&CHAR(10)&\"Compétences : \"&Vendredi!$G142))","v":""}]
[{"$f":"IF(AND(Lundi!$D143=\"\",Lundi!$G143=\"\"),\"\",IF(Lundi!$D143=\"Récréation\",CONCATENATE(Lundi!A143&\" / \"&Lundi!B143)&CHAR(10)&\"RECREATION\",CONCATENATE(Lundi!A143&\" / \"&Lundi!B143)&CHAR(10)&\"Matière : \"&Lundi!$D143&CHAR(10)&\"Compétences : \"&Lundi!$G143))","v":""},{"$f":"IF(AND(Mardi!$D143=\"\",Mardi!$G143=\"\"),\"\",IF(Mardi!$D143=\"Récréation\",CONCATENATE(Mardi!$A143&\" / \"&Mardi!$B143)&CHAR(10)&\"RECREATION\",CONCATENATE(Mardi!$A143&\" / \"&Mardi!$B143)&CHAR(10)&\"Matière : \"&Mardi!$D143&CHAR(10)&\"Compétences : \"&Mardi!$G143))","v":""},{"$f":"IF(AND(Mercredi!$D143=\"\",Mercredi!$G143=\"\"),\"\",IF(Mercredi!$D143=\"Récréation\",CONCATENATE(Mercredi!$A143&\" / \"&Mercredi!$B143)&CHAR(10)&\"RECREATION\",CONCATENATE(Mercredi!$A143&\" / \"&Mercredi!$B143)&CHAR(10)&\"Matière : \"&Mercredi!$D143&CHAR(10)&\"Compétences : \"&Mercredi!$G143))","v":""},{"$f":"IF(AND(Jeudi!$D143=\"\",Jeudi!$G143=\"\"),\"\",IF(Jeudi!$D143=\"Récréation\",CONCATENATE(Jeudi!$A143&\" / \"&Jeudi!$B143)&CHAR(10)&\"RECREATION\",CONCATENATE(Jeudi!$A143&\" / \"&Jeudi!$B143)&CHAR(10)&\"Matière : \"&Jeudi!$D143&CHAR(10)&\"Compétences : \"&Jeudi!$G143))","v":""},{"$f":"IF(AND(Vendredi!$D143=\"\",Vendredi!$G143=\"\"),\"\",IF(Vendredi!$D143=\"Récréation\",CONCATENATE(Vendredi!$A143&\" / \"&Vendredi!$B143)&CHAR(10)&\"RECREATION\",CONCATENATE(Vendredi!$A143&\" / \"&Vendredi!$B143)&CHAR(10)&\"Matière : \"&Vendredi!$D143&CHAR(10)&\"Compétences : \"&Vendredi!$G143))","v":""}]
[{"$f":"IF(AND(Lundi!$D144=\"\",Lundi!$G144=\"\"),\"\",IF(Lundi!$D144=\"Récréation\",CONCATENATE(Lundi!A144&\" / \"&Lundi!B144)&CHAR(10)&\"RECREATION\",CONCATENATE(Lundi!A144&\" / \"&Lundi!B144)&CHAR(10)&\"Matière : \"&Lundi!$D144&CHAR(10)&\"Compétences : \"&Lundi!$G144))","v":""},{"$f":"IF(AND(Mardi!$D144=\"\",Mardi!$G144=\"\"),\"\",IF(Mardi!$D144=\"Récréation\",CONCATENATE(Mardi!$A144&\" / \"&Mardi!$B144)&CHAR(10)&\"RECREATION\",CONCATENATE(Mardi!$A144&\" / \"&Mardi!$B144)&CHAR(10)&\"Matière : \"&Mardi!$D144&CHAR(10)&\"Compétences : \"&Mardi!$G144))","v":""},{"$f":"IF(AND(Mercredi!$D144=\"\",Mercredi!$G144=\"\"),\"\",IF(Mercredi!$D144=\"Récréation\",CONCATENATE(Mercredi!$A144&\" / \"&Mercredi!$B144)&CHAR(10)&\"RECREATION\",CONCATENATE(Mercredi!$A144&\" / \"&Mercredi!$B144)&CHAR(10)&\"Matière : \"&Mercredi!$D144&CHAR(10)&\"Compétences : \"&Mercredi!$G144))","v":""},{"$f":"IF(AND(Jeudi!$D144=\"\",Jeudi!$G144=\"\"),\"\",IF(Jeudi!$D144=\"Récréation\",CONCATENATE(Jeudi!$A144&\" / \"&Jeudi!$B144)&CHAR(10)&\"RECREATION\",CONCATENATE(Jeudi!$A144&\" / \"&Jeudi!$B144)&CHAR(10)&\"Matière : \"&Jeudi!$D144&CHAR(10)&\"Compétences : \"&Jeudi!$G144))","v":""},{"$f":"IF(AND(Vendredi!$D144=\"\",Vendredi!$G144=\"\"),\"\",IF(Vendredi!$D144=\"Récréation\",CONCATENATE(Vendredi!$A144&\" / \"&Vendredi!$B144)&CHAR(10)&\"RECREATION\",CONCATENATE(Vendredi!$A144&\" / \"&Vendredi!$B144)&CHAR(10)&\"Matière : \"&Vendredi!$D144&CHAR(10)&\"Compétences : \"&Vendredi!$G144))","v":""}]
[{"$f":"IF(AND(Lundi!$D145=\"\",Lundi!$G145=\"\"),\"\",IF(Lundi!$D145=\"Récréation\",CONCATENATE(Lundi!A145&\" / \"&Lundi!B145)&CHAR(10)&\"RECREATION\",CONCATENATE(Lundi!A145&\" / \"&Lundi!B145)&CHAR(10)&\"Matière : \"&Lundi!$D145&CHAR(10)&\"Compétences : \"&Lundi!$G145))","v":""},{"$f":"IF(AND(Mardi!$D145=\"\",Mardi!$G145=\"\"),\"\",IF(Mardi!$D145=\"Récréation\",CONCATENATE(Mardi!$A145&\" / \"&Mardi!$B145)&CHAR(10)&\"RECREATION\",CONCATENATE(Mardi!$A145&\" / \"&Mardi!$B145)&CHAR(10)&\"Matière : \"&Mardi!$D145&CHAR(10)&\"Compétences : \"&Mardi!$G145))","v":""},{"$f":"IF(AND(Mercredi!$D145=\"\",Mercredi!$G145=\"\"),\"\",IF(Mercredi!$D145=\"Récréation\",CONCATENATE(Mercredi!$A145&\" / \"&Mercredi!$B145)&CHAR(10)&\"RECREATION\",CONCATENATE(Mercredi!$A145&\" / \"&Mercredi!$B145)&CHAR(10)&\"Matière : \"&Mercredi!$D145&CHAR(10)&\"Compétences : \"&Mercredi!$G145))","v":""},{"$f":"IF(AND(Jeudi!$D145=\"\",Jeudi!$G145=\"\"),\"\",IF(Jeudi!$D145=\"Récréation\",CONCATENATE(Jeudi!$A145&\" / \"&Jeudi!$B145)&CHAR(10)&\"RECREATION\",CONCATENATE(Jeudi!$A145&\" / \"&Jeudi!$B145)&CHAR(10)&\"Matière : \"&Jeudi!$D145&CHAR(10)&\"Compétences : \"&Jeudi!$G145))","v":""},{"$f":"IF(AND(Vendredi!$D145=\"\",Vendredi!$G145=\"\"),\"\",IF(Vendredi!$D145=\"Récréation\",CONCATENATE(Vendredi!$A145&\" / \"&Vendredi!$B145)&CHAR(10)&\"RECREATION\",CONCATENATE(Vendredi!$A145&\" / \"&Vendredi!$B145)&CHAR(10)&\"Matière : \"&Vendredi!$D145&CHAR(10)&\"Compétences : \"&Vendredi!$G145))","v":""}]
[{"$f":"IF(AND(Lundi!$D146=\"\",Lundi!$G146=\"\"),\"\",IF(Lundi!$D146=\"Récréation\",CONCATENATE(Lundi!A146&\" / \"&Lundi!B146)&CHAR(10)&\"RECREATION\",CONCATENATE(Lundi!A146&\" / \"&Lundi!B146)&CHAR(10)&\"Matière : \"&Lundi!$D146&CHAR(10)&\"Compétences : \"&Lundi!$G146))","v":""},{"$f":"IF(AND(Mardi!$D146=\"\",Mardi!$G146=\"\"),\"\",IF(Mardi!$D146=\"Récréation\",CONCATENATE(Mardi!$A146&\" / \"&Mardi!$B146)&CHAR(10)&\"RECREATION\",CONCATENATE(Mardi!$A146&\" / \"&Mardi!$B146)&CHAR(10)&\"Matière : \"&Mardi!$D146&CHAR(10)&\"Compétences : \"&Mardi!$G146))","v":""},{"$f":"IF(AND(Mercredi!$D146=\"\",Mercredi!$G146=\"\"),\"\",IF(Mercredi!$D146=\"Récréation\",CONCATENATE(Mercredi!$A146&\" / \"&Mercredi!$B146)&CHAR(10)&\"RECREATION\",CONCATENATE(Mercredi!$A146&\" / \"&Mercredi!$B146)&CHAR(10)&\"Matière : \"&Mercredi!$D146&CHAR(10)&\"Compétences : \"&Mercredi!$G146))","v":""},{"$f":"IF(AND(Jeudi!$D146=\"\",Jeudi!$G146=\"\"),\"\",IF(Jeudi!$D146=\"Récréation\",CONCATENATE(Jeudi!$A146&\" / \"&Jeudi!$B146)&CHAR(10)&\"RECREATION\",CONCATENATE(Jeudi!$A146&\" / \"&Jeudi!$B146)&CHAR(10)&\"Matière : \"&Jeudi!$D146&CHAR(10)&\"Compétences : \"&Jeudi!$G146))","v":""},{"$f":"IF(AND(Vendredi!$D146=\"\",Vendredi!$G146=\"\"),\"\",IF(Vendredi!$D146=\"Récréation\",CONCATENATE(Vendredi!$A146&\" / \"&Vendredi!$B146)&CHAR(10)&\"RECREATION\",CONCATENATE(Vendredi!$A146&\" / \"&Vendredi!$B146)&CHAR(10)&\"Matière : \"&Vendredi!$D146&CHAR(10)&\"Compétences : \"&Vendredi!$G146))","v":""}]
[{"$f":"IF(AND(Lundi!$D147=\"\",Lundi!$G147=\"\"),\"\",IF(Lundi!$D147=\"Récréation\",CONCATENATE(Lundi!A147&\" / \"&Lundi!B147)&CHAR(10)&\"RECREATION\",CONCATENATE(Lundi!A147&\" / \"&Lundi!B147)&CHAR(10)&\"Matière : \"&Lundi!$D147&CHAR(10)&\"Compétences : \"&Lundi!$G147))","v":""},{"$f":"IF(AND(Mardi!$D147=\"\",Mardi!$G147=\"\"),\"\",IF(Mardi!$D147=\"Récréation\",CONCATENATE(Mardi!$A147&\" / \"&Mardi!$B147)&CHAR(10)&\"RECREATION\",CONCATENATE(Mardi!$A147&\" / \"&Mardi!$B147)&CHAR(10)&\"Matière : \"&Mardi!$D147&CHAR(10)&\"Compétences : \"&Mardi!$G147))","v":""},{"$f":"IF(AND(Mercredi!$D147=\"\",Mercredi!$G147=\"\"),\"\",IF(Mercredi!$D147=\"Récréation\",CONCATENATE(Mercredi!$A147&\" / \"&Mercredi!$B147)&CHAR(10)&\"RECREATION\",CONCATENATE(Mercredi!$A147&\" / \"&Mercredi!$B147)&CHAR(10)&\"Matière : \"&Mercredi!$D147&CHAR(10)&\"Compétences : \"&Mercredi!$G147))","v":""},{"$f":"IF(AND(Jeudi!$D147=\"\",Jeudi!$G147=\"\"),\"\",IF(Jeudi!$D147=\"Récréation\",CONCATENATE(Jeudi!$A147&\" / \"&Jeudi!$B147)&CHAR(10)&\"RECREATION\",CONCATENATE(Jeudi!$A147&\" / \"&Jeudi!$B147)&CHAR(10)&\"Matière : \"&Jeudi!$D147&CHAR(10)&\"Compétences : \"&Jeudi!$G147))","v":""},{"$f":"IF(AND(Vendredi!$D147=\"\",Vendredi!$G147=\"\"),\"\",IF(Vendredi!$D147=\"Récréation\",CONCATENATE(Vendredi!$A147&\" / \"&Vendredi!$B147)&CHAR(10)&\"RECREATION\",CONCATENATE(Vendredi!$A147&\" / \"&Vendredi!$B147)&CHAR(10)&\"Matière : \"&Vendredi!$D147&CHAR(10)&\"Compétences : \"&Vendredi!$G147))","v":""}]
[{"$f":"IF(AND(Lundi!$D148=\"\",Lundi!$G148=\"\"),\"\",IF(Lundi!$D148=\"Récréation\",CONCATENATE(Lundi!A148&\" / \"&Lundi!B148)&CHAR(10)&\"RECREATION\",CONCATENATE(Lundi!A148&\" / \"&Lundi!B148)&CHAR(10)&\"Matière : \"&Lundi!$D148&CHAR(10)&\"Compétences : \"&Lundi!$G148))","v":""},{"$f":"IF(AND(Mardi!$D148=\"\",Mardi!$G148=\"\"),\"\",IF(Mardi!$D148=\"Récréation\",CONCATENATE(Mardi!$A148&\" / \"&Mardi!$B148)&CHAR(10)&\"RECREATION\",CONCATENATE(Mardi!$A148&\" / \"&Mardi!$B148)&CHAR(10)&\"Matière : \"&Mardi!$D148&CHAR(10)&\"Compétences : \"&Mardi!$G148))","v":""},{"$f":"IF(AND(Mercredi!$D148=\"\",Mercredi!$G148=\"\"),\"\",IF(Mercredi!$D148=\"Récréation\",CONCATENATE(Mercredi!$A148&\" / \"&Mercredi!$B148)&CHAR(10)&\"RECREATION\",CONCATENATE(Mercredi!$A148&\" / \"&Mercredi!$B148)&CHAR(10)&\"Matière : \"&Mercredi!$D148&CHAR(10)&\"Compétences : \"&Mercredi!$G148))","v":""},{"$f":"IF(AND(Jeudi!$D148=\"\",Jeudi!$G148=\"\"),\"\",IF(Jeudi!$D148=\"Récréation\",CONCATENATE(Jeudi!$A148&\" / \"&Jeudi!$B148)&CHAR(10)&\"RECREATION\",CONCATENATE(Jeudi!$A148&\" / \"&Jeudi!$B148)&CHAR(10)&\"Matière : \"&Jeudi!$D148&CHAR(10)&\"Compétences : \"&Jeudi!$G148))","v":""},{"$f":"IF(AND(Vendredi!$D148=\"\",Vendredi!$G148=\"\"),\"\",IF(Vendredi!$D148=\"Récréation\",CONCATENATE(Vendredi!$A148&\" / \"&Vendredi!$B148)&CHAR(10)&\"RECREATION\",CONCATENATE(Vendredi!$A148&\" / \"&Vendredi!$B148)&CHAR(10)&\"Matière : \"&Vendredi!$D148&CHAR(10)&\"Compétences : \"&Vendredi!$G148))","v":""}]
[{"$f":"IF(AND(Lundi!$D149=\"\",Lundi!$G149=\"\"),\"\",IF(Lundi!$D149=\"Récréation\",CONCATENATE(Lundi!A149&\" / \"&Lundi!B149)&CHAR(10)&\"RECREATION\",CONCATENATE(Lundi!A149&\" / \"&Lundi!B149)&CHAR(10)&\"Matière : \"&Lundi!$D149&CHAR(10)&\"Compétences : \"&Lundi!$G149))","v":""},{"$f":"IF(AND(Mardi!$D149=\"\",Mardi!$G149=\"\"),\"\",IF(Mardi!$D149=\"Récréation\",CONCATENATE(Mardi!$A149&\" / \"&Mardi!$B149)&CHAR(10)&\"RECREATION\",CONCATENATE(Mardi!$A149&\" / \"&Mardi!$B149)&CHAR(10)&\"Matière : \"&Mardi!$D149&CHAR(10)&\"Compétences : \"&Mardi!$G149))","v":""},{"$f":"IF(AND(Mercredi!$D149=\"\",Mercredi!$G149=\"\"),\"\",IF(Mercredi!$D149=\"Récréation\",CONCATENATE(Mercredi!$A149&\" / \"&Mercredi!$B149)&CHAR(10)&\"RECREATION\",CONCATENATE(Mercredi!$A149&\" / \"&Mercredi!$B149)&CHAR(10)&\"Matière : \"&Mercredi!$D149&CHAR(10)&\"Compétences : \"&Mercredi!$G149))","v":""},{"$f":"IF(AND(Jeudi!$D149=\"\",Jeudi!$G149=\"\"),\"\",IF(Jeudi!$D149=\"Récréation\",CONCATENATE(Jeudi!$A149&\" / \"&Jeudi!$B149)&CHAR(10)&\"RECREATION\",CONCATENATE(Jeudi!$A149&\" / \"&Jeudi!$B149)&CHAR(10)&\"Matière : \"&Jeudi!$D149&CHAR(10)&\"Compétences : \"&Jeudi!$G149))","v":""},{"$f":"IF(AND(Vendredi!$D149=\"\",Vendredi!$G149=\"\"),\"\",IF(Vendredi!$D149=\"Récréation\",CONCATENATE(Vendredi!$A149&\" / \"&Vendredi!$B149)&CHAR(10)&\"RECREATION\",CONCATENATE(Vendredi!$A149&\" / \"&Vendredi!$B149)&CHAR(10)&\"Matière : \"&Vendredi!$D149&CHAR(10)&\"Compétences : \"&Vendredi!$G149))","v":""}]
[{"$f":"IF(AND(Lundi!$D150=\"\",Lundi!$G150=\"\"),\"\",IF(Lundi!$D150=\"Récréation\",CONCATENATE(Lundi!A150&\" / \"&Lundi!B150)&CHAR(10)&\"RECREATION\",CONCATENATE(Lundi!A150&\" / \"&Lundi!B150)&CHAR(10)&\"Matière : \"&Lundi!$D150&CHAR(10)&\"Compétences : \"&Lundi!$G150))","v":""},{"$f":"IF(AND(Mardi!$D150=\"\",Mardi!$G150=\"\"),\"\",IF(Mardi!$D150=\"Récréation\",CONCATENATE(Mardi!$A150&\" / \"&Mardi!$B150)&CHAR(10)&\"RECREATION\",CONCATENATE(Mardi!$A150&\" / \"&Mardi!$B150)&CHAR(10)&\"Matière : \"&Mardi!$D150&CHAR(10)&\"Compétences : \"&Mardi!$G150))","v":""},{"$f":"IF(AND(Mercredi!$D150=\"\",Mercredi!$G150=\"\"),\"\",IF(Mercredi!$D150=\"Récréation\",CONCATENATE(Mercredi!$A150&\" / \"&Mercredi!$B150)&CHAR(10)&\"RECREATION\",CONCATENATE(Mercredi!$A150&\" / \"&Mercredi!$B150)&CHAR(10)&\"Matière : \"&Mercredi!$D150&CHAR(10)&\"Compétences : \"&Mercredi!$G150))","v":""},{"$f":"IF(AND(Jeudi!$D150=\"\",Jeudi!$G150=\"\"),\"\",IF(Jeudi!$D150=\"Récréation\",CONCATENATE(Jeudi!$A150&\" / \"&Jeudi!$B150)&CHAR(10)&\"RECREATION\",CONCATENATE(Jeudi!$A150&\" / \"&Jeudi!$B150)&CHAR(10)&\"Matière : \"&Jeudi!$D150&CHAR(10)&\"Compétences : \"&Jeudi!$G150))","v":""},{"$f":"IF(AND(Vendredi!$D150=\"\",Vendredi!$G150=\"\"),\"\",IF(Vendredi!$D150=\"Récréation\",CONCATENATE(Vendredi!$A150&\" / \"&Vendredi!$B150)&CHAR(10)&\"RECREATION\",CONCATENATE(Vendredi!$A150&\" / \"&Vendredi!$B150)&CHAR(10)&\"Matière : \"&Vendredi!$D150&CHAR(10)&\"Compétences : \"&Vendredi!$G150))","v":""}]
[{"$f":"IF(AND(Lundi!$D151=\"\",Lundi!$G151=\"\"),\"\",IF(Lundi!$D151=\"Récréation\",CONCATENATE(Lundi!A151&\" / \"&Lundi!B151)&CHAR(10)&\"RECREATION\",CONCATENATE(Lundi!A151&\" / \"&Lundi!B151)&CHAR(10)&\"Matière : \"&Lundi!$D151&CHAR(10)&\"Compétences : \"&Lundi!$G151))","v":""},{"$f":"IF(AND(Mardi!$D151=\"\",Mardi!$G151=\"\"),\"\",IF(Mardi!$D151=\"Récréation\",CONCATENATE(Mardi!$A151&\" / \"&Mardi!$B151)&CHAR(10)&\"RECREATION\",CONCATENATE(Mardi!$A151&\" / \"&Mardi!$B151)&CHAR(10)&\"Matière : \"&Mardi!$D151&CHAR(10)&\"Compétences : \"&Mardi!$G151))","v":""},{"$f":"IF(AND(Mercredi!$D151=\"\",Mercredi!$G151=\"\"),\"\",IF(Mercredi!$D151=\"Récréation\",CONCATENATE(Mercredi!$A151&\" / \"&Mercredi!$B151)&CHAR(10)&\"RECREATION\",CONCATENATE(Mercredi!$A151&\" / \"&Mercredi!$B151)&CHAR(10)&\"Matière : \"&Mercredi!$D151&CHAR(10)&\"Compétences : \"&Mercredi!$G151))","v":""},{"$f":"IF(AND(Jeudi!$D151=\"\",Jeudi!$G151=\"\"),\"\",IF(Jeudi!$D151=\"Récréation\",CONCATENATE(Jeudi!$A151&\" / \"&Jeudi!$B151)&CHAR(10)&\"RECREATION\",CONCATENATE(Jeudi!$A151&\" / \"&Jeudi!$B151)&CHAR(10)&\"Matière : \"&Jeudi!$D151&CHAR(10)&\"Compétences : \"&Jeudi!$G151))","v":""},{"$f":"IF(AND(Vendredi!$D151=\"\",Vendredi!$G151=\"\"),\"\",IF(Vendredi!$D151=\"Récréation\",CONCATENATE(Vendredi!$A151&\" / \"&Vendredi!$B151)&CHAR(10)&\"RECREATION\",CONCATENATE(Vendredi!$A151&\" / \"&Vendredi!$B151)&CHAR(10)&\"Matière : \"&Vendredi!$D151&CHAR(10)&\"Compétences : \"&Vendredi!$G151))","v":""}]
[{"$f":"IF(AND(Lundi!$D152=\"\",Lundi!$G152=\"\"),\"\",IF(Lundi!$D152=\"Récréation\",CONCATENATE(Lundi!A152&\" / \"&Lundi!B152)&CHAR(10)&\"RECREATION\",CONCATENATE(Lundi!A152&\" / \"&Lundi!B152)&CHAR(10)&\"Matière : \"&Lundi!$D152&CHAR(10)&\"Compétences : \"&Lundi!$G152))","v":""},{"$f":"IF(AND(Mardi!$D152=\"\",Mardi!$G152=\"\"),\"\",IF(Mardi!$D152=\"Récréation\",CONCATENATE(Mardi!$A152&\" / \"&Mardi!$B152)&CHAR(10)&\"RECREATION\",CONCATENATE(Mardi!$A152&\" / \"&Mardi!$B152)&CHAR(10)&\"Matière : \"&Mardi!$D152&CHAR(10)&\"Compétences : \"&Mardi!$G152))","v":""},{"$f":"IF(AND(Mercredi!$D152=\"\",Mercredi!$G152=\"\"),\"\",IF(Mercredi!$D152=\"Récréation\",CONCATENATE(Mercredi!$A152&\" / \"&Mercredi!$B152)&CHAR(10)&\"RECREATION\",CONCATENATE(Mercredi!$A152&\" / \"&Mercredi!$B152)&CHAR(10)&\"Matière : \"&Mercredi!$D152&CHAR(10)&\"Compétences : \"&Mercredi!$G152))","v":""},{"$f":"IF(AND(Jeudi!$D152=\"\",Jeudi!$G152=\"\"),\"\",IF(Jeudi!$D152=\"Récréation\",CONCATENATE(Jeudi!$A152&\" / \"&Jeudi!$B152)&CHAR(10)&\"RECREATION\",CONCATENATE(Jeudi!$A152&\" / \"&Jeudi!$B152)&CHAR(10)&\"Matière : \"&Jeudi!$D152&CHAR(10)&\"Compétences : \"&Jeudi!$G152))","v":""},{"$f":"IF(AND(Vendredi!$D152=\"\",Vendredi!$G152=\"\"),\"\",IF(Vendredi!$D152=\"Récréation\",CONCATENATE(Vendredi!$A152&\" / \"&Vendredi!$B152)&CHAR(10)&\"RECREATION\",CONCATENATE(Vendredi!$A152&\" / \"&Vendredi!$B152)&CHAR(10)&\"Matière : \"&Vendredi!$D152&CHAR(10)&\"Compétences : \"&Vendredi!$G152))","v":""}]
[{"$f":"IF(AND(Lundi!$D153=\"\",Lundi!$G153=\"\"),\"\",IF(Lundi!$D153=\"Récréation\",CONCATENATE(Lundi!A153&\" / \"&Lundi!B153)&CHAR(10)&\"RECREATION\",CONCATENATE(Lundi!A153&\" / \"&Lundi!B153)&CHAR(10)&\"Matière : \"&Lundi!$D153&CHAR(10)&\"Compétences : \"&Lundi!$G153))","v":""},{"$f":"IF(AND(Mardi!$D153=\"\",Mardi!$G153=\"\"),\"\",IF(Mardi!$D153=\"Récréation\",CONCATENATE(Mardi!$A153&\" / \"&Mardi!$B153)&CHAR(10)&\"RECREATION\",CONCATENATE(Mardi!$A153&\" / \"&Mardi!$B153)&CHAR(10)&\"Matière : \"&Mardi!$D153&CHAR(10)&\"Compétences : \"&Mardi!$G153))","v":""},{"$f":"IF(AND(Mercredi!$D153=\"\",Mercredi!$G153=\"\"),\"\",IF(Mercredi!$D153=\"Récréation\",CONCATENATE(Mercredi!$A153&\" / \"&Mercredi!$B153)&CHAR(10)&\"RECREATION\",CONCATENATE(Mercredi!$A153&\" / \"&Mercredi!$B153)&CHAR(10)&\"Matière : \"&Mercredi!$D153&CHAR(10)&\"Compétences : \"&Mercredi!$G153))","v":""},{"$f":"IF(AND(Jeudi!$D153=\"\",Jeudi!$G153=\"\"),\"\",IF(Jeudi!$D153=\"Récréation\",CONCATENATE(Jeudi!$A153&\" / \"&Jeudi!$B153)&CHAR(10)&\"RECREATION\",CONCATENATE(Jeudi!$A153&\" / \"&Jeudi!$B153)&CHAR(10)&\"Matière : \"&Jeudi!$D153&CHAR(10)&\"Compétences : \"&Jeudi!$G153))","v":""},{"$f":"IF(AND(Vendredi!$D153=\"\",Vendredi!$G153=\"\"),\"\",IF(Vendredi!$D153=\"Récréation\",CONCATENATE(Vendredi!$A153&\" / \"&Vendredi!$B153)&CHAR(10)&\"RECREATION\",CONCATENATE(Vendredi!$A153&\" / \"&Vendredi!$B153)&CHAR(10)&\"Matière : \"&Vendredi!$D153&CHAR(10)&\"Compétences : \"&Vendredi!$G153))","v":""}]
[{"$f":"IF(AND(Lundi!$D154=\"\",Lundi!$G154=\"\"),\"\",IF(Lundi!$D154=\"Récréation\",CONCATENATE(Lundi!A154&\" / \"&Lundi!B154)&CHAR(10)&\"RECREATION\",CONCATENATE(Lundi!A154&\" / \"&Lundi!B154)&CHAR(10)&\"Matière : \"&Lundi!$D154&CHAR(10)&\"Compétences : \"&Lundi!$G154))","v":""},{"$f":"IF(AND(Mardi!$D154=\"\",Mardi!$G154=\"\"),\"\",IF(Mardi!$D154=\"Récréation\",CONCATENATE(Mardi!$A154&\" / \"&Mardi!$B154)&CHAR(10)&\"RECREATION\",CONCATENATE(Mardi!$A154&\" / \"&Mardi!$B154)&CHAR(10)&\"Matière : \"&Mardi!$D154&CHAR(10)&\"Compétences : \"&Mardi!$G154))","v":""},{"$f":"IF(AND(Mercredi!$D154=\"\",Mercredi!$G154=\"\"),\"\",IF(Mercredi!$D154=\"Récréation\",CONCATENATE(Mercredi!$A154&\" / \"&Mercredi!$B154)&CHAR(10)&\"RECREATION\",CONCATENATE(Mercredi!$A154&\" / \"&Mercredi!$B154)&CHAR(10)&\"Matière : \"&Mercredi!$D154&CHAR(10)&\"Compétences : \"&Mercredi!$G154))","v":""},{"$f":"IF(AND(Jeudi!$D154=\"\",Jeudi!$G154=\"\"),\"\",IF(Jeudi!$D154=\"Récréation\",CONCATENATE(Jeudi!$A154&\" / \"&Jeudi!$B154)&CHAR(10)&\"RECREATION\",CONCATENATE(Jeudi!$A154&\" / \"&Jeudi!$B154)&CHAR(10)&\"Matière : \"&Jeudi!$D154&CHAR(10)&\"Compétences : \"&Jeudi!$G154))","v":""},{"$f":"IF(AND(Vendredi!$D154=\"\",Vendredi!$G154=\"\"),\"\",IF(Vendredi!$D154=\"Récréation\",CONCATENATE(Vendredi!$A154&\" / \"&Vendredi!$B154)&CHAR(10)&\"RECREATION\",CONCATENATE(Vendredi!$A154&\" / \"&Vendredi!$B154)&CHAR(10)&\"Matière : \"&Vendredi!$D154&CHAR(10)&\"Compétences : \"&Vendredi!$G154))","v":""}]
[{"$f":"IF(AND(Lundi!$D155=\"\",Lundi!$G155=\"\"),\"\",IF(Lundi!$D155=\"Récréation\",CONCATENATE(Lundi!A155&\" / \"&Lundi!B155)&CHAR(10)&\"RECREATION\",CONCATENATE(Lundi!A155&\" / \"&Lundi!B155)&CHAR(10)&\"Matière : \"&Lundi!$D155&CHAR(10)&\"Compétences : \"&Lundi!$G155))","v":""},{"$f":"IF(AND(Mardi!$D155=\"\",Mardi!$G155=\"\"),\"\",IF(Mardi!$D155=\"Récréation\",CONCATENATE(Mardi!$A155&\" / \"&Mardi!$B155)&CHAR(10)&\"RECREATION\",CONCATENATE(Mardi!$A155&\" / \"&Mardi!$B155)&CHAR(10)&\"Matière : \"&Mardi!$D155&CHAR(10)&\"Compétences : \"&Mardi!$G155))","v":""},{"$f":"IF(AND(Mercredi!$D155=\"\",Mercredi!$G155=\"\"),\"\",IF(Mercredi!$D155=\"Récréation\",CONCATENATE(Mercredi!$A155&\" / \"&Mercredi!$B155)&CHAR(10)&\"RECREATION\",CONCATENATE(Mercredi!$A155&\" / \"&Mercredi!$B155)&CHAR(10)&\"Matière : \"&Mercredi!$D155&CHAR(10)&\"Compétences : \"&Mercredi!$G155))","v":""},{"$f":"IF(AND(Jeudi!$D155=\"\",Jeudi!$G155=\"\"),\"\",IF(Jeudi!$D155=\"Récréation\",CONCATENATE(Jeudi!$A155&\" / \"&Jeudi!$B155)&CHAR(10)&\"RECREATION\",CONCATENATE(Jeudi!$A155&\" / \"&Jeudi!$B155)&CHAR(10)&\"Matière : \"&Jeudi!$D155&CHAR(10)&\"Compétences : \"&Jeudi!$G155))","v":""},{"$f":"IF(AND(Vendredi!$D155=\"\",Vendredi!$G155=\"\"),\"\",IF(Vendredi!$D155=\"Récréation\",CONCATENATE(Vendredi!$A155&\" / \"&Vendredi!$B155)&CHAR(10)&\"RECREATION\",CONCATENATE(Vendredi!$A155&\" / \"&Vendredi!$B155)&CHAR(10)&\"Matière : \"&Vendredi!$D155&CHAR(10)&\"Compétences : \"&Vendredi!$G155))","v":""}]
[{"$f":"IF(AND(Lundi!$D156=\"\",Lundi!$G156=\"\"),\"\",IF(Lundi!$D156=\"Récréation\",CONCATENATE(Lundi!A156&\" / \"&Lundi!B156)&CHAR(10)&\"RECREATION\",CONCATENATE(Lundi!A156&\" / \"&Lundi!B156)&CHAR(10)&\"Matière : \"&Lundi!$D156&CHAR(10)&\"Compétences : \"&Lundi!$G156))","v":""},{"$f":"IF(AND(Mardi!$D156=\"\",Mardi!$G156=\"\"),\"\",IF(Mardi!$D156=\"Récréation\",CONCATENATE(Mardi!$A156&\" / \"&Mardi!$B156)&CHAR(10)&\"RECREATION\",CONCATENATE(Mardi!$A156&\" / \"&Mardi!$B156)&CHAR(10)&\"Matière : \"&Mardi!$D156&CHAR(10)&\"Compétences : \"&Mardi!$G156))","v":""},{"$f":"IF(AND(Mercredi!$D156=\"\",Mercredi!$G156=\"\"),\"\",IF(Mercredi!$D156=\"Récréation\",CONCATENATE(Mercredi!$A156&\" / \"&Mercredi!$B156)&CHAR(10)&\"RECREATION\",CONCATENATE(Mercredi!$A156&\" / \"&Mercredi!$B156)&CHAR(10)&\"Matière : \"&Mercredi!$D156&CHAR(10)&\"Compétences : \"&Mercredi!$G156))","v":""},{"$f":"IF(AND(Jeudi!$D156=\"\",Jeudi!$G156=\"\"),\"\",IF(Jeudi!$D156=\"Récréation\",CONCATENATE(Jeudi!$A156&\" / \"&Jeudi!$B156)&CHAR(10)&\"RECREATION\",CONCATENATE(Jeudi!$A156&\" / \"&Jeudi!$B156)&CHAR(10)&\"Matière : \"&Jeudi!$D156&CHAR(10)&\"Compétences : \"&Jeudi!$G156))","v":""},{"$f":"IF(AND(Vendredi!$D156=\"\",Vendredi!$G156=\"\"),\"\",IF(Vendredi!$D156=\"Récréation\",CONCATENATE(Vendredi!$A156&\" / \"&Vendredi!$B156)&CHAR(10)&\"RECREATION\",CONCATENATE(Vendredi!$A156&\" / \"&Vendredi!$B156)&CHAR(10)&\"Matière : \"&Vendredi!$D156&CHAR(10)&\"Compétences : \"&Vendredi!$G156))","v":""}]
[{"$f":"IF(AND(Lundi!$D157=\"\",Lundi!$G157=\"\"),\"\",IF(Lundi!$D157=\"Récréation\",CONCATENATE(Lundi!A157&\" / \"&Lundi!B157)&CHAR(10)&\"RECREATION\",CONCATENATE(Lundi!A157&\" / \"&Lundi!B157)&CHAR(10)&\"Matière : \"&Lundi!$D157&CHAR(10)&\"Compétences : \"&Lundi!$G157))","v":""},{"$f":"IF(AND(Mardi!$D157=\"\",Mardi!$G157=\"\"),\"\",IF(Mardi!$D157=\"Récréation\",CONCATENATE(Mardi!$A157&\" / \"&Mardi!$B157)&CHAR(10)&\"RECREATION\",CONCATENATE(Mardi!$A157&\" / \"&Mardi!$B157)&CHAR(10)&\"Matière : \"&Mardi!$D157&CHAR(10)&\"Compétences : \"&Mardi!$G157))","v":""},{"$f":"IF(AND(Mercredi!$D157=\"\",Mercredi!$G157=\"\"),\"\",IF(Mercredi!$D157=\"Récréation\",CONCATENATE(Mercredi!$A157&\" / \"&Mercredi!$B157)&CHAR(10)&\"RECREATION\",CONCATENATE(Mercredi!$A157&\" / \"&Mercredi!$B157)&CHAR(10)&\"Matière : \"&Mercredi!$D157&CHAR(10)&\"Compétences : \"&Mercredi!$G157))","v":""},{"$f":"IF(AND(Jeudi!$D157=\"\",Jeudi!$G157=\"\"),\"\",IF(Jeudi!$D157=\"Récréation\",CONCATENATE(Jeudi!$A157&\" / \"&Jeudi!$B157)&CHAR(10)&\"RECREATION\",CONCATENATE(Jeudi!$A157&\" / \"&Jeudi!$B157)&CHAR(10)&\"Matière : \"&Jeudi!$D157&CHAR(10)&\"Compétences : \"&Jeudi!$G157))","v":""},{"$f":"IF(AND(Vendredi!$D157=\"\",Vendredi!$G157=\"\"),\"\",IF(Vendredi!$D157=\"Récréation\",CONCATENATE(Vendredi!$A157&\" / \"&Vendredi!$B157)&CHAR(10)&\"RECREATION\",CONCATENATE(Vendredi!$A157&\" / \"&Vendredi!$B157)&CHAR(10)&\"Matière : \"&Vendredi!$D157&CHAR(10)&\"Compétences : \"&Vendredi!$G157))","v":""}]
[{"$f":"IF(AND(Lundi!$D158=\"\",Lundi!$G158=\"\"),\"\",IF(Lundi!$D158=\"Récréation\",CONCATENATE(Lundi!A158&\" / \"&Lundi!B158)&CHAR(10)&\"RECREATION\",CONCATENATE(Lundi!A158&\" / \"&Lundi!B158)&CHAR(10)&\"Matière : \"&Lundi!$D158&CHAR(10)&\"Compétences : \"&Lundi!$G158))","v":""},{"$f":"IF(AND(Mardi!$D158=\"\",Mardi!$G158=\"\"),\"\",IF(Mardi!$D158=\"Récréation\",CONCATENATE(Mardi!$A158&\" / \"&Mardi!$B158)&CHAR(10)&\"RECREATION\",CONCATENATE(Mardi!$A158&\" / \"&Mardi!$B158)&CHAR(10)&\"Matière : \"&Mardi!$D158&CHAR(10)&\"Compétences : \"&Mardi!$G158))","v":""},{"$f":"IF(AND(Mercredi!$D158=\"\",Mercredi!$G158=\"\"),\"\",IF(Mercredi!$D158=\"Récréation\",CONCATENATE(Mercredi!$A158&\" / \"&Mercredi!$B158)&CHAR(10)&\"RECREATION\",CONCATENATE(Mercredi!$A158&\" / \"&Mercredi!$B158)&CHAR(10)&\"Matière : \"&Mercredi!$D158&CHAR(10)&\"Compétences : \"&Mercredi!$G158))","v":""},{"$f":"IF(AND(Jeudi!$D158=\"\",Jeudi!$G158=\"\"),\"\",IF(Jeudi!$D158=\"Récréation\",CONCATENATE(Jeudi!$A158&\" / \"&Jeudi!$B158)&CHAR(10)&\"RECREATION\",CONCATENATE(Jeudi!$A158&\" / \"&Jeudi!$B158)&CHAR(10)&\"Matière : \"&Jeudi!$D158&CHAR(10)&\"Compétences : \"&Jeudi!$G158))","v":""},{"$f":"IF(AND(Vendredi!$D158=\"\",Vendredi!$G158=\"\"),\"\",IF(Vendredi!$D158=\"Récréation\",CONCATENATE(Vendredi!$A158&\" / \"&Vendredi!$B158)&CHAR(10)&\"RECREATION\",CONCATENATE(Vendredi!$A158&\" / \"&Vendredi!$B158)&CHAR(10)&\"Matière : \"&Vendredi!$D158&CHAR(10)&\"Compétences : \"&Vendredi!$G158))","v":""}]
[{"$f":"IF(AND(Lundi!$D159=\"\",Lundi!$G159=\"\"),\"\",IF(Lundi!$D159=\"Récréation\",CONCATENATE(Lundi!A159&\" / \"&Lundi!B159)&CHAR(10)&\"RECREATION\",CONCATENATE(Lundi!A159&\" / \"&Lundi!B159)&CHAR(10)&\"Matière : \"&Lundi!$D159&CHAR(10)&\"Compétences : \"&Lundi!$G159))","v":""},{"$f":"IF(AND(Mardi!$D159=\"\",Mardi!$G159=\"\"),\"\",IF(Mardi!$D159=\"Récréation\",CONCATENATE(Mardi!$A159&\" / \"&Mardi!$B159)&CHAR(10)&\"RECREATION\",CONCATENATE(Mardi!$A159&\" / \"&Mardi!$B159)&CHAR(10)&\"Matière : \"&Mardi!$D159&CHAR(10)&\"Compétences : \"&Mardi!$G159))","v":""},{"$f":"IF(AND(Mercredi!$D159=\"\",Mercredi!$G159=\"\"),\"\",IF(Mercredi!$D159=\"Récréation\",CONCATENATE(Mercredi!$A159&\" / \"&Mercredi!$B159)&CHAR(10)&\"RECREATION\",CONCATENATE(Mercredi!$A159&\" / \"&Mercredi!$B159)&CHAR(10)&\"Matière : \"&Mercredi!$D159&CHAR(10)&\"Compétences : \"&Mercredi!$G159))","v":""},{"$f":"IF(AND(Jeudi!$D159=\"\",Jeudi!$G159=\"\"),\"\",IF(Jeudi!$D159=\"Récréation\",CONCATENATE(Jeudi!$A159&\" / \"&Jeudi!$B159)&CHAR(10)&\"RECREATION\",CONCATENATE(Jeudi!$A159&\" / \"&Jeudi!$B159)&CHAR(10)&\"Matière : \"&Jeudi!$D159&CHAR(10)&\"Compétences : \"&Jeudi!$G159))","v":""},{"$f":"IF(AND(Vendredi!$D159=\"\",Vendredi!$G159=\"\"),\"\",IF(Vendredi!$D159=\"Récréation\",CONCATENATE(Vendredi!$A159&\" / \"&Vendredi!$B159)&CHAR(10)&\"RECREATION\",CONCATENATE(Vendredi!$A159&\" / \"&Vendredi!$B159)&CHAR(10)&\"Matière : \"&Vendredi!$D159&CHAR(10)&\"Compétences : \"&Vendredi!$G159))","v":""}]
[{"$f":"IF(AND(Lundi!$D160=\"\",Lundi!$G160=\"\"),\"\",IF(Lundi!$D160=\"Récréation\",CONCATENATE(Lundi!A160&\" / \"&Lundi!B160)&CHAR(10)&\"RECREATION\",CONCATENATE(Lundi!A160&\" / \"&Lundi!B160)&CHAR(10)&\"Matière : \"&Lundi!$D160&CHAR(10)&\"Compétences : \"&Lundi!$G160))","v":""},{"$f":"IF(AND(Mardi!$D160=\"\",Mardi!$G160=\"\"),\"\",IF(Mardi!$D160=\"Récréation\",CONCATENATE(Mardi!$A160&\" / \"&Mardi!$B160)&CHAR(10)&\"RECREATION\",CONCATENATE(Mardi!$A160&\" / \"&Mardi!$B160)&CHAR(10)&\"Matière : \"&Mardi!$D160&CHAR(10)&\"Compétences : \"&Mardi!$G160))","v":""},{"$f":"IF(AND(Mercredi!$D160=\"\",Mercredi!$G160=\"\"),\"\",IF(Mercredi!$D160=\"Récréation\",CONCATENATE(Mercredi!$A160&\" / \"&Mercredi!$B160)&CHAR(10)&\"RECREATION\",CONCATENATE(Mercredi!$A160&\" / \"&Mercredi!$B160)&CHAR(10)&\"Matière : \"&Mercredi!$D160&CHAR(10)&\"Compétences : \"&Mercredi!$G160))","v":""},{"$f":"IF(AND(Jeudi!$D160=\"\",Jeudi!$G160=\"\"),\"\",IF(Jeudi!$D160=\"Récréation\",CONCATENATE(Jeudi!$A160&\" / \"&Jeudi!$B160)&CHAR(10)&\"RECREATION\",CONCATENATE(Jeudi!$A160&\" / \"&Jeudi!$B160)&CHAR(10)&\"Matière : \"&Jeudi!$D160&CHAR(10)&\"Compétences : \"&Jeudi!$G160))","v":""},{"$f":"IF(AND(Vendredi!$D160=\"\",Vendredi!$G160=\"\"),\"\",IF(Vendredi!$D160=\"Récréation\",CONCATENATE(Vendredi!$A160&\" / \"&Vendredi!$B160)&CHAR(10)&\"RECREATION\",CONCATENATE(Vendredi!$A160&\" / \"&Vendredi!$B160)&CHAR(10)&\"Matière : \"&Vendredi!$D160&CHAR(10)&\"Compétences : \"&Vendredi!$G160))","v":""}]
[{"$f":"IF(AND(Lundi!$D161=\"\",Lundi!$G161=\"\"),\"\",IF(Lundi!$D161=\"Récréation\",CONCATENATE(Lundi!A161&\" / \"&Lundi!B161)&CHAR(10)&\"RECREATION\",CONCATENATE(Lundi!A161&\" / \"&Lundi!B161)&CHAR(10)&\"Matière : \"&Lundi!$D161&CHAR(10)&\"Compétences : \"&Lundi!$G161))","v":""},{"$f":"IF(AND(Mardi!$D161=\"\",Mardi!$G161=\"\"),\"\",IF(Mardi!$D161=\"Récréation\",CONCATENATE(Mardi!$A161&\" / \"&Mardi!$B161)&CHAR(10)&\"RECREATION\",CONCATENATE(Mardi!$A161&\" / \"&Mardi!$B161)&CHAR(10)&\"Matière : \"&Mardi!$D161&CHAR(10)&\"Compétences : \"&Mardi!$G161))","v":""},{"$f":"IF(AND(Mercredi!$D161=\"\",Mercredi!$G161=\"\"),\"\",IF(Mercredi!$D161=\"Récréation\",CONCATENATE(Mercredi!$A161&\" / \"&Mercredi!$B161)&CHAR(10)&\"RECREATION\",CONCATENATE(Mercredi!$A161&\" / \"&Mercredi!$B161)&CHAR(10)&\"Matière : \"&Mercredi!$D161&CHAR(10)&\"Compétences : \"&Mercredi!$G161))","v":""},{"$f":"IF(AND(Jeudi!$D161=\"\",Jeudi!$G161=\"\"),\"\",IF(Jeudi!$D161=\"Récréation\",CONCATENATE(Jeudi!$A161&\" / \"&Jeudi!$B161)&CHAR(10)&\"RECREATION\",CONCATENATE(Jeudi!$A161&\" / \"&Jeudi!$B161)&CHAR(10)&\"Matière : \"&Jeudi!$D161&CHAR(10)&\"Compétences : \"&Jeudi!$G161))","v":""},{"$f":"IF(AND(Vendredi!$D161=\"\",Vendredi!$G161=\"\"),\"\",IF(Vendredi!$D161=\"Récréation\",CONCATENATE(Vendredi!$A161&\" / \"&Vendredi!$B161)&CHAR(10)&\"RECREATION\",CONCATENATE(Vendredi!$A161&\" / \"&Vendredi!$B161)&CHAR(10)&\"Matière : \"&Vendredi!$D161&CHAR(10)&\"Compétences : \"&Vendredi!$G161))","v":""}]
[{"$f":"IF(AND(Lundi!$D162=\"\",Lundi!$G162=\"\"),\"\",IF(Lundi!$D162=\"Récréation\",CONCATENATE(Lundi!A162&\" / \"&Lundi!B162)&CHAR(10)&\"RECREATION\",CONCATENATE(Lundi!A162&\" / \"&Lundi!B162)&CHAR(10)&\"Matière : \"&Lundi!$D162&CHAR(10)&\"Compétences : \"&Lundi!$G162))","v":""},{"$f":"IF(AND(Mardi!$D162=\"\",Mardi!$G162=\"\"),\"\",IF(Mardi!$D162=\"Récréation\",CONCATENATE(Mardi!$A162&\" / \"&Mardi!$B162)&CHAR(10)&\"RECREATION\",CONCATENATE(Mardi!$A162&\" / \"&Mardi!$B162)&CHAR(10)&\"Matière : \"&Mardi!$D162&CHAR(10)&\"Compétences : \"&Mardi!$G162))","v":""},{"$f":"IF(AND(Mercredi!$D162=\"\",Mercredi!$G162=\"\"),\"\",IF(Mercredi!$D162=\"Récréation\",CONCATENATE(Mercredi!$A162&\" / \"&Mercredi!$B162)&CHAR(10)&\"RECREATION\",CONCATENATE(Mercredi!$A162&\" / \"&Mercredi!$B162)&CHAR(10)&\"Matière : \"&Mercredi!$D162&CHAR(10)&\"Compétences : \"&Mercredi!$G162))","v":""},{"$f":"IF(AND(Jeudi!$D162=\"\",Jeudi!$G162=\"\"),\"\",IF(Jeudi!$D162=\"Récréation\",CONCATENATE(Jeudi!$A162&\" / \"&Jeudi!$B162)&CHAR(10)&\"RECREATION\",CONCATENATE(Jeudi!$A162&\" / \"&Jeudi!$B162)&CHAR(10)&\"Matière : \"&Jeudi!$D162&CHAR(10)&\"Compétences : \"&Jeudi!$G162))","v":""},{"$f":"IF(AND(Vendredi!$D162=\"\",Vendredi!$G162=\"\"),\"\",IF(Vendredi!$D162=\"Récréation\",CONCATENATE(Vendredi!$A162&\" / \"&Vendredi!$B162)&CHAR(10)&\"RECREATION\",CONCATENATE(Vendredi!$A162&\" / \"&Vendredi!$B162)&CHAR(10)&\"Matière : \"&Vendredi!$D162&CHAR(10)&\"Compétences : \"&Vendredi!$G162))","v":""}]
[{"$f":"IF(AND(Lundi!$D163=\"\",Lundi!$G163=\"\"),\"\",IF(Lundi!$D163=\"Récréation\",CONCATENATE(Lundi!A163&\" / \"&Lundi!B163)&CHAR(10)&\"RECREATION\",CONCATENATE(Lundi!A163&\" / \"&Lundi!B163)&CHAR(10)&\"Matière : \"&Lundi!$D163&CHAR(10)&\"Compétences : \"&Lundi!$G163))","v":""},{"$f":"IF(AND(Mardi!$D163=\"\",Mardi!$G163=\"\"),\"\",IF(Mardi!$D163=\"Récréation\",CONCATENATE(Mardi!$A163&\" / \"&Mardi!$B163)&CHAR(10)&\"RECREATION\",CONCATENATE(Mardi!$A163&\" / \"&Mardi!$B163)&CHAR(10)&\"Matière : \"&Mardi!$D163&CHAR(10)&\"Compétences : \"&Mardi!$G163))","v":""},{"$f":"IF(AND(Mercredi!$D163=\"\",Mercredi!$G163=\"\"),\"\",IF(Mercredi!$D163=\"Récréation\",CONCATENATE(Mercredi!$A163&\" / \"&Mercredi!$B163)&CHAR(10)&\"RECREATION\",CONCATENATE(Mercredi!$A163&\" / \"&Mercredi!$B163)&CHAR(10)&\"Matière : \"&Mercredi!$D163&CHAR(10)&\"Compétences : \"&Mercredi!$G163))","v":""},{"$f":"IF(AND(Jeudi!$D163=\"\",Jeudi!$G163=\"\"),\"\",IF(Jeudi!$D163=\"Récréation\",CONCATENATE(Jeudi!$A163&\" / \"&Jeudi!$B163)&CHAR(10)&\"RECREATION\",CONCATENATE(Jeudi!$A163&\" / \"&Jeudi!$B163)&CHAR(10)&\"Matière : \"&Jeudi!$D163&CHAR(10)&\"Compétences : \"&Jeudi!$G163))","v":""},{"$f":"IF(AND(Vendredi!$D163=\"\",Vendredi!$G163=\"\"),\"\",IF(Vendredi!$D163=\"Récréation\",CONCATENATE(Vendredi!$A163&\" / \"&Vendredi!$B163)&CHAR(10)&\"RECREATION\",CONCATENATE(Vendredi!$A163&\" / \"&Vendredi!$B163)&CHAR(10)&\"Matière : \"&Vendredi!$D163&CHAR(10)&\"Compétences : \"&Vendredi!$G163))","v":""}]
[{"$f":"IF(AND(Lundi!$D164=\"\",Lundi!$G164=\"\"),\"\",IF(Lundi!$D164=\"Récréation\",CONCATENATE(Lundi!A164&\" / \"&Lundi!B164)&CHAR(10)&\"RECREATION\",CONCATENATE(Lundi!A164&\" / \"&Lundi!B164)&CHAR(10)&\"Matière : \"&Lundi!$D164&CHAR(10)&\"Compétences : \"&Lundi!$G164))","v":""},{"$f":"IF(AND(Mardi!$D164=\"\",Mardi!$G164=\"\"),\"\",IF(Mardi!$D164=\"Récréation\",CONCATENATE(Mardi!$A164&\" / \"&Mardi!$B164)&CHAR(10)&\"RECREATION\",CONCATENATE(Mardi!$A164&\" / \"&Mardi!$B164)&CHAR(10)&\"Matière : \"&Mardi!$D164&CHAR(10)&\"Compétences : \"&Mardi!$G164))","v":""},{"$f":"IF(AND(Mercredi!$D164=\"\",Mercredi!$G164=\"\"),\"\",IF(Mercredi!$D164=\"Récréation\",CONCATENATE(Mercredi!$A164&\" / \"&Mercredi!$B164)&CHAR(10)&\"RECREATION\",CONCATENATE(Mercredi!$A164&\" / \"&Mercredi!$B164)&CHAR(10)&\"Matière : \"&Mercredi!$D164&CHAR(10)&\"Compétences : \"&Mercredi!$G164))","v":""},{"$f":"IF(AND(Jeudi!$D164=\"\",Jeudi!$G164=\"\"),\"\",IF(Jeudi!$D164=\"Récréation\",CONCATENATE(Jeudi!$A164&\" / \"&Jeudi!$B164)&CHAR(10)&\"RECREATION\",CONCATENATE(Jeudi!$A164&\" / \"&Jeudi!$B164)&CHAR(10)&\"Matière : \"&Jeudi!$D164&CHAR(10)&\"Compétences : \"&Jeudi!$G164))","v":""},{"$f":"IF(AND(Vendredi!$D164=\"\",Vendredi!$G164=\"\"),\"\",IF(Vendredi!$D164=\"Récréation\",CONCATENATE(Vendredi!$A164&\" / \"&Vendredi!$B164)&CHAR(10)&\"RECREATION\",CONCATENATE(Vendredi!$A164&\" / \"&Vendredi!$B164)&CHAR(10)&\"Matière : \"&Vendredi!$D164&CHAR(10)&\"Compétences : \"&Vendredi!$G164))","v":""}]
[{"$f":"IF(AND(Lundi!$D165=\"\",Lundi!$G165=\"\"),\"\",IF(Lundi!$D165=\"Récréation\",CONCATENATE(Lundi!A165&\" / \"&Lundi!B165)&CHAR(10)&\"RECREATION\",CONCATENATE(Lundi!A165&\" / \"&Lundi!B165)&CHAR(10)&\"Matière : \"&Lundi!$D165&CHAR(10)&\"Compétences : \"&Lundi!$G165))","v":""},{"$f":"IF(AND(Mardi!$D165=\"\",Mardi!$G165=\"\"),\"\",IF(Mardi!$D165=\"Récréation\",CONCATENATE(Mardi!$A165&\" / \"&Mardi!$B165)&CHAR(10)&\"RECREATION\",CONCATENATE(Mardi!$A165&\" / \"&Mardi!$B165)&CHAR(10)&\"Matière : \"&Mardi!$D165&CHAR(10)&\"Compétences : \"&Mardi!$G165))","v":""},{"$f":"IF(AND(Mercredi!$D165=\"\",Mercredi!$G165=\"\"),\"\",IF(Mercredi!$D165=\"Récréation\",CONCATENATE(Mercredi!$A165&\" / \"&Mercredi!$B165)&CHAR(10)&\"RECREATION\",CONCATENATE(Mercredi!$A165&\" / \"&Mercredi!$B165)&CHAR(10)&\"Matière : \"&Mercredi!$D165&CHAR(10)&\"Compétences : \"&Mercredi!$G165))","v":""},{"$f":"IF(AND(Jeudi!$D165=\"\",Jeudi!$G165=\"\"),\"\",IF(Jeudi!$D165=\"Récréation\",CONCATENATE(Jeudi!$A165&\" / \"&Jeudi!$B165)&CHAR(10)&\"RECREATION\",CONCATENATE(Jeudi!$A165&\" / \"&Jeudi!$B165)&CHAR(10)&\"Matière : \"&Jeudi!$D165&CHAR(10)&\"Compétences : \"&Jeudi!$G165))","v":""},{"$f":"IF(AND(Vendredi!$D165=\"\",Vendredi!$G165=\"\"),\"\",IF(Vendredi!$D165=\"Récréation\",CONCATENATE(Vendredi!$A165&\" / \"&Vendredi!$B165)&CHAR(10)&\"RECREATION\",CONCATENATE(Vendredi!$A165&\" / \"&Vendredi!$B165)&CHAR(10)&\"Matière : \"&Vendredi!$D165&CHAR(10)&\"Compétences : \"&Vendredi!$G165))","v":""}]
[{"$f":"IF(AND(Lundi!$D166=\"\",Lundi!$G166=\"\"),\"\",IF(Lundi!$D166=\"Récréation\",CONCATENATE(Lundi!A166&\" / \"&Lundi!B166)&CHAR(10)&\"RECREATION\",CONCATENATE(Lundi!A166&\" / \"&Lundi!B166)&CHAR(10)&\"Matière : \"&Lundi!$D166&CHAR(10)&\"Compétences : \"&Lundi!$G166))","v":""},{"$f":"IF(AND(Mardi!$D166=\"\",Mardi!$G166=\"\"),\"\",IF(Mardi!$D166=\"Récréation\",CONCATENATE(Mardi!$A166&\" / \"&Mardi!$B166)&CHAR(10)&\"RECREATION\",CONCATENATE(Mardi!$A166&\" / \"&Mardi!$B166)&CHAR(10)&\"Matière : \"&Mardi!$D166&CHAR(10)&\"Compétences : \"&Mardi!$G166))","v":""},{"$f":"IF(AND(Mercredi!$D166=\"\",Mercredi!$G166=\"\"),\"\",IF(Mercredi!$D166=\"Récréation\",CONCATENATE(Mercredi!$A166&\" / \"&Mercredi!$B166)&CHAR(10)&\"RECREATION\",CONCATENATE(Mercredi!$A166&\" / \"&Mercredi!$B166)&CHAR(10)&\"Matière : \"&Mercredi!$D166&CHAR(10)&\"Compétences : \"&Mercredi!$G166))","v":""},{"$f":"IF(AND(Jeudi!$D166=\"\",Jeudi!$G166=\"\"),\"\",IF(Jeudi!$D166=\"Récréation\",CONCATENATE(Jeudi!$A166&\" / \"&Jeudi!$B166)&CHAR(10)&\"RECREATION\",CONCATENATE(Jeudi!$A166&\" / \"&Jeudi!$B166)&CHAR(10)&\"Matière : \"&Jeudi!$D166&CHAR(10)&\"Compétences : \"&Jeudi!$G166))","v":""},{"$f":"IF(AND(Vendredi!$D166=\"\",Vendredi!$G166=\"\"),\"\",IF(Vendredi!$D166=\"Récréation\",CONCATENATE(Vendredi!$A166&\" / \"&Vendredi!$B166)&CHAR(10)&\"RECREATION\",CONCATENATE(Vendredi!$A166&\" / \"&Vendredi!$B166)&CHAR(10)&\"Matière : \"&Vendredi!$D166&CHAR(10)&\"Compétences : \"&Vendredi!$G166))","v":""}]
[{"$f":"IF(AND(Lundi!$D167=\"\",Lundi!$G167=\"\"),\"\",IF(Lundi!$D167=\"Récréation\",CONCATENATE(Lundi!A167&\" / \"&Lundi!B167)&CHAR(10)&\"RECREATION\",CONCATENATE(Lundi!A167&\" / \"&Lundi!B167)&CHAR(10)&\"Matière : \"&Lundi!$D167&CHAR(10)&\"Compétences : \"&Lundi!$G167))","v":""},{"$f":"IF(AND(Mardi!$D167=\"\",Mardi!$G167=\"\"),\"\",IF(Mardi!$D167=\"Récréation\",CONCATENATE(Mardi!$A167&\" / \"&Mardi!$B167)&CHAR(10)&\"RECREATION\",CONCATENATE(Mardi!$A167&\" / \"&Mardi!$B167)&CHAR(10)&\"Matière : \"&Mardi!$D167&CHAR(10)&\"Compétences : \"&Mardi!$G167))","v":""},{"$f":"IF(AND(Mercredi!$D167=\"\",Mercredi!$G167=\"\"),\"\",IF(Mercredi!$D167=\"Récréation\",CONCATENATE(Mercredi!$A167&\" / \"&Mercredi!$B167)&CHAR(10)&\"RECREATION\",CONCATENATE(Mercredi!$A167&\" / \"&Mercredi!$B167)&CHAR(10)&\"Matière : \"&Mercredi!$D167&CHAR(10)&\"Compétences : \"&Mercredi!$G167))","v":""},{"$f":"IF(AND(Jeudi!$D167=\"\",Jeudi!$G167=\"\"),\"\",IF(Jeudi!$D167=\"Récréation\",CONCATENATE(Jeudi!$A167&\" / \"&Jeudi!$B167)&CHAR(10)&\"RECREATION\",CONCATENATE(Jeudi!$A167&\" / \"&Jeudi!$B167)&CHAR(10)&\"Matière : \"&Jeudi!$D167&CHAR(10)&\"Compétences : \"&Jeudi!$G167))","v":""},{"$f":"IF(AND(Vendredi!$D167=\"\",Vendredi!$G167=\"\"),\"\",IF(Vendredi!$D167=\"Récréation\",CONCATENATE(Vendredi!$A167&\" / \"&Vendredi!$B167)&CHAR(10)&\"RECREATION\",CONCATENATE(Vendredi!$A167&\" / \"&Vendredi!$B167)&CHAR(10)&\"Matière : \"&Vendredi!$D167&CHAR(10)&\"Compétences : \"&Vendredi!$G167))","v":""}]
[{"$f":"IF(AND(Lundi!$D168=\"\",Lundi!$G168=\"\"),\"\",IF(Lundi!$D168=\"Récréation\",CONCATENATE(Lundi!A168&\" / \"&Lundi!B168)&CHAR(10)&\"RECREATION\",CONCATENATE(Lundi!A168&\" / \"&Lundi!B168)&CHAR(10)&\"Matière : \"&Lundi!$D168&CHAR(10)&\"Compétences : \"&Lundi!$G168))","v":""},{"$f":"IF(AND(Mardi!$D168=\"\",Mardi!$G168=\"\"),\"\",IF(Mardi!$D168=\"Récréation\",CONCATENATE(Mardi!$A168&\" / \"&Mardi!$B168)&CHAR(10)&\"RECREATION\",CONCATENATE(Mardi!$A168&\" / \"&Mardi!$B168)&CHAR(10)&\"Matière : \"&Mardi!$D168&CHAR(10)&\"Compétences : \"&Mardi!$G168))","v":""},{"$f":"IF(AND(Mercredi!$D168=\"\",Mercredi!$G168=\"\"),\"\",IF(Mercredi!$D168=\"Récréation\",CONCATENATE(Mercredi!$A168&\" / \"&Mercredi!$B168)&CHAR(10)&\"RECREATION\",CONCATENATE(Mercredi!$A168&\" / \"&Mercredi!$B168)&CHAR(10)&\"Matière : \"&Mercredi!$D168&CHAR(10)&\"Compétences : \"&Mercredi!$G168))","v":""},{"$f":"IF(AND(Jeudi!$D168=\"\",Jeudi!$G168=\"\"),\"\",IF(Jeudi!$D168=\"Récréation\",CONCATENATE(Jeudi!$A168&\" / \"&Jeudi!$B168)&CHAR(10)&\"RECREATION\",CONCATENATE(Jeudi!$A168&\" / \"&Jeudi!$B168)&CHAR(10)&\"Matière : \"&Jeudi!$D168&CHAR(10)&\"Compétences : \"&Jeudi!$G168))","v":""},{"$f":"IF(AND(Vendredi!$D168=\"\",Vendredi!$G168=\"\"),\"\",IF(Vendredi!$D168=\"Récréation\",CONCATENATE(Vendredi!$A168&\" / \"&Vendredi!$B168)&CHAR(10)&\"RECREATION\",CONCATENATE(Vendredi!$A168&\" / \"&Vendredi!$B168)&CHAR(10)&\"Matière : \"&Vendredi!$D168&CHAR(10)&\"Compétences : \"&Vendredi!$G168))","v":""}]
[{"$f":"IF(AND(Lundi!$D169=\"\",Lundi!$G169=\"\"),\"\",IF(Lundi!$D169=\"Récréation\",CONCATENATE(Lundi!A169&\" / \"&Lundi!B169)&CHAR(10)&\"RECREATION\",CONCATENATE(Lundi!A169&\" / \"&Lundi!B169)&CHAR(10)&\"Matière : \"&Lundi!$D169&CHAR(10)&\"Compétences : \"&Lundi!$G169))","v":""},{"$f":"IF(AND(Mardi!$D169=\"\",Mardi!$G169=\"\"),\"\",IF(Mardi!$D169=\"Récréation\",CONCATENATE(Mardi!$A169&\" / \"&Mardi!$B169)&CHAR(10)&\"RECREATION\",CONCATENATE(Mardi!$A169&\" / \"&Mardi!$B169)&CHAR(10)&\"Matière : \"&Mardi!$D169&CHAR(10)&\"Compétences : \"&Mardi!$G169))","v":""},{"$f":"IF(AND(Mercredi!$D169=\"\",Mercredi!$G169=\"\"),\"\",IF(Mercredi!$D169=\"Récréation\",CONCATENATE(Mercredi!$A169&\" / \"&Mercredi!$B169)&CHAR(10)&\"RECREATION\",CONCATENATE(Mercredi!$A169&\" / \"&Mercredi!$B169)&CHAR(10)&\"Matière : \"&Mercredi!$D169&CHAR(10)&\"Compétences : \"&Mercredi!$G169))","v":""},{"$f":"IF(AND(Jeudi!$D169=\"\",Jeudi!$G169=\"\"),\"\",IF(Jeudi!$D169=\"Récréation\",CONCATENATE(Jeudi!$A169&\" / \"&Jeudi!$B169)&CHAR(10)&\"RECREATION\",CONCATENATE(Jeudi!$A169&\" / \"&Jeudi!$B169)&CHAR(10)&\"Matière : \"&Jeudi!$D169&CHAR(10)&\"Compétences : \"&Jeudi!$G169))","v":""},{"$f":"IF(AND(Vendredi!$D169=\"\",Vendredi!$G169=\"\"),\"\",IF(Vendredi!$D169=\"Récréation\",CONCATENATE(Vendredi!$A169&\" / \"&Vendredi!$B169)&CHAR(10)&\"RECREATION\",CONCATENATE(Vendredi!$A169&\" / \"&Vendredi!$B169)&CHAR(10)&\"Matière : \"&Vendredi!$D169&CHAR(10)&\"Compétences : \"&Vendredi!$G169))","v":""}]
[{"$f":"IF(AND(Lundi!$D170=\"\",Lundi!$G170=\"\"),\"\",IF(Lundi!$D170=\"Récréation\",CONCATENATE(Lundi!A170&\" / \"&Lundi!B170)&CHAR(10)&\"RECREATION\",CONCATENATE(Lundi!A170&\" / \"&Lundi!B170)&CHAR(10)&\"Matière : \"&Lundi!$D170&CHAR(10)&\"Compétences : \"&Lundi!$G170))","v":""},{"$f":"IF(AND(Mardi!$D170=\"\",Mardi!$G170=\"\"),\"\",IF(Mardi!$D170=\"Récréation\",CONCATENATE(Mardi!$A170&\" / \"&Mardi!$B170)&CHAR(10)&\"RECREATION\",CONCATENATE(Mardi!$A170&\" / \"&Mardi!$B170)&CHAR(10)&\"Matière : \"&Mardi!$D170&CHAR(10)&\"Compétences : \"&Mardi!$G170))","v":""},{"$f":"IF(AND(Mercredi!$D170=\"\",Mercredi!$G170=\"\"),\"\",IF(Mercredi!$D170=\"Récréation\",CONCATENATE(Mercredi!$A170&\" / \"&Mercredi!$B170)&CHAR(10)&\"RECREATION\",CONCATENATE(Mercredi!$A170&\" / \"&Mercredi!$B170)&CHAR(10)&\"Matière : \"&Mercredi!$D170&CHAR(10)&\"Compétences : \"&Mercredi!$G170))","v":""},{"$f":"IF(AND(Jeudi!$D170=\"\",Jeudi!$G170=\"\"),\"\",IF(Jeudi!$D170=\"Récréation\",CONCATENATE(Jeudi!$A170&\" / \"&Jeudi!$B170)&CHAR(10)&\"RECREATION\",CONCATENATE(Jeudi!$A170&\" / \"&Jeudi!$B170)&CHAR(10)&\"Matière : \"&Jeudi!$D170&CHAR(10)&\"Compétences : \"&Jeudi!$G170))","v":""},{"$f":"IF(AND(Vendredi!$D170=\"\",Vendredi!$G170=\"\"),\"\",IF(Vendredi!$D170=\"Récréation\",CONCATENATE(Vendredi!$A170&\" / \"&Vendredi!$B170)&CHAR(10)&\"RECREATION\",CONCATENATE(Vendredi!$A170&\" / \"&Vendredi!$B170)&CHAR(10)&\"Matière : \"&Vendredi!$D170&CHAR(10)&\"Compétences : \"&Vendredi!$G170))","v":""}]
[{"$f":"IF(AND(Lundi!$D171=\"\",Lundi!$G171=\"\"),\"\",IF(Lundi!$D171=\"Récréation\",CONCATENATE(Lundi!A171&\" / \"&Lundi!B171)&CHAR(10)&\"RECREATION\",CONCATENATE(Lundi!A171&\" / \"&Lundi!B171)&CHAR(10)&\"Matière : \"&Lundi!$D171&CHAR(10)&\"Compétences : \"&Lundi!$G171))","v":""},{"$f":"IF(AND(Mardi!$D171=\"\",Mardi!$G171=\"\"),\"\",IF(Mardi!$D171=\"Récréation\",CONCATENATE(Mardi!$A171&\" / \"&Mardi!$B171)&CHAR(10)&\"RECREATION\",CONCATENATE(Mardi!$A171&\" / \"&Mardi!$B171)&CHAR(10)&\"Matière : \"&Mardi!$D171&CHAR(10)&\"Compétences : \"&Mardi!$G171))","v":""},{"$f":"IF(AND(Mercredi!$D171=\"\",Mercredi!$G171=\"\"),\"\",IF(Mercredi!$D171=\"Récréation\",CONCATENATE(Mercredi!$A171&\" / \"&Mercredi!$B171)&CHAR(10)&\"RECREATION\",CONCATENATE(Mercredi!$A171&\" / \"&Mercredi!$B171)&CHAR(10)&\"Matière : \"&Mercredi!$D171&CHAR(10)&\"Compétences : \"&Mercredi!$G171))","v":""},{"$f":"IF(AND(Jeudi!$D171=\"\",Jeudi!$G171=\"\"),\"\",IF(Jeudi!$D171=\"Récréation\",CONCATENATE(Jeudi!$A171&\" / \"&Jeudi!$B171)&CHAR(10)&\"RECREATION\",CONCATENATE(Jeudi!$A171&\" / \"&Jeudi!$B171)&CHAR(10)&\"Matière : \"&Jeudi!$D171&CHAR(10)&\"Compétences : \"&Jeudi!$G171))","v":""},{"$f":"IF(AND(Vendredi!$D171=\"\",Vendredi!$G171=\"\"),\"\",IF(Vendredi!$D171=\"Récréation\",CONCATENATE(Vendredi!$A171&\" / \"&Vendredi!$B171)&CHAR(10)&\"RECREATION\",CONCATENATE(Vendredi!$A171&\" / \"&Vendredi!$B171)&CHAR(10)&\"Matière : \"&Vendredi!$D171&CHAR(10)&\"Compétences : \"&Vendredi!$G171))","v":""}]
[{"$f":"IF(AND(Lundi!$D172=\"\",Lundi!$G172=\"\"),\"\",IF(Lundi!$D172=\"Récréation\",CONCATENATE(Lundi!A172&\" / \"&Lundi!B172)&CHAR(10)&\"RECREATION\",CONCATENATE(Lundi!A172&\" / \"&Lundi!B172)&CHAR(10)&\"Matière : \"&Lundi!$D172&CHAR(10)&\"Compétences : \"&Lundi!$G172))","v":""},{"$f":"IF(AND(Mardi!$D172=\"\",Mardi!$G172=\"\"),\"\",IF(Mardi!$D172=\"Récréation\",CONCATENATE(Mardi!$A172&\" / \"&Mardi!$B172)&CHAR(10)&\"RECREATION\",CONCATENATE(Mardi!$A172&\" / \"&Mardi!$B172)&CHAR(10)&\"Matière : \"&Mardi!$D172&CHAR(10)&\"Compétences : \"&Mardi!$G172))","v":""},{"$f":"IF(AND(Mercredi!$D172=\"\",Mercredi!$G172=\"\"),\"\",IF(Mercredi!$D172=\"Récréation\",CONCATENATE(Mercredi!$A172&\" / \"&Mercredi!$B172)&CHAR(10)&\"RECREATION\",CONCATENATE(Mercredi!$A172&\" / \"&Mercredi!$B172)&CHAR(10)&\"Matière : \"&Mercredi!$D172&CHAR(10)&\"Compétences : \"&Mercredi!$G172))","v":""},{"$f":"IF(AND(Jeudi!$D172=\"\",Jeudi!$G172=\"\"),\"\",IF(Jeudi!$D172=\"Récréation\",CONCATENATE(Jeudi!$A172&\" / \"&Jeudi!$B172)&CHAR(10)&\"RECREATION\",CONCATENATE(Jeudi!$A172&\" / \"&Jeudi!$B172)&CHAR(10)&\"Matière : \"&Jeudi!$D172&CHAR(10)&\"Compétences : \"&Jeudi!$G172))","v":""},{"$f":"IF(AND(Vendredi!$D172=\"\",Vendredi!$G172=\"\"),\"\",IF(Vendredi!$D172=\"Récréation\",CONCATENATE(Vendredi!$A172&\" / \"&Vendredi!$B172)&CHAR(10)&\"RECREATION\",CONCATENATE(Vendredi!$A172&\" / \"&Vendredi!$B172)&CHAR(10)&\"Matière : \"&Vendredi!$D172&CHAR(10)&\"Compétences : \"&Vendredi!$G172))","v":""}]
[{"$f":"IF(AND(Lundi!$D173=\"\",Lundi!$G173=\"\"),\"\",IF(Lundi!$D173=\"Récréation\",CONCATENATE(Lundi!A173&\" / \"&Lundi!B173)&CHAR(10)&\"RECREATION\",CONCATENATE(Lundi!A173&\" / \"&Lundi!B173)&CHAR(10)&\"Matière : \"&Lundi!$D173&CHAR(10)&\"Compétences : \"&Lundi!$G173))","v":""},{"$f":"IF(AND(Mardi!$D173=\"\",Mardi!$G173=\"\"),\"\",IF(Mardi!$D173=\"Récréation\",CONCATENATE(Mardi!$A173&\" / \"&Mardi!$B173)&CHAR(10)&\"RECREATION\",CONCATENATE(Mardi!$A173&\" / \"&Mardi!$B173)&CHAR(10)&\"Matière : \"&Mardi!$D173&CHAR(10)&\"Compétences : \"&Mardi!$G173))","v":""},{"$f":"IF(AND(Mercredi!$D173=\"\",Mercredi!$G173=\"\"),\"\",IF(Mercredi!$D173=\"Récréation\",CONCATENATE(Mercredi!$A173&\" / \"&Mercredi!$B173)&CHAR(10)&\"RECREATION\",CONCATENATE(Mercredi!$A173&\" / \"&Mercredi!$B173)&CHAR(10)&\"Matière : \"&Mercredi!$D173&CHAR(10)&\"Compétences : \"&Mercredi!$G173))","v":""},{"$f":"IF(AND(Jeudi!$D173=\"\",Jeudi!$G173=\"\"),\"\",IF(Jeudi!$D173=\"Récréation\",CONCATENATE(Jeudi!$A173&\" / \"&Jeudi!$B173)&CHAR(10)&\"RECREATION\",CONCATENATE(Jeudi!$A173&\" / \"&Jeudi!$B173)&CHAR(10)&\"Matière : \"&Jeudi!$D173&CHAR(10)&\"Compétences : \"&Jeudi!$G173))","v":""},{"$f":"IF(AND(Vendredi!$D173=\"\",Vendredi!$G173=\"\"),\"\",IF(Vendredi!$D173=\"Récréation\",CONCATENATE(Vendredi!$A173&\" / \"&Vendredi!$B173)&CHAR(10)&\"RECREATION\",CONCATENATE(Vendredi!$A173&\" / \"&Vendredi!$B173)&CHAR(10)&\"Matière : \"&Vendredi!$D173&CHAR(10)&\"Compétences : \"&Vendredi!$G173))","v":""}]
[{"$f":"IF(AND(Lundi!$D174=\"\",Lundi!$G174=\"\"),\"\",IF(Lundi!$D174=\"Récréation\",CONCATENATE(Lundi!A174&\" / \"&Lundi!B174)&CHAR(10)&\"RECREATION\",CONCATENATE(Lundi!A174&\" / \"&Lundi!B174)&CHAR(10)&\"Matière : \"&Lundi!$D174&CHAR(10)&\"Compétences : \"&Lundi!$G174))","v":""},{"$f":"IF(AND(Mardi!$D174=\"\",Mardi!$G174=\"\"),\"\",IF(Mardi!$D174=\"Récréation\",CONCATENATE(Mardi!$A174&\" / \"&Mardi!$B174)&CHAR(10)&\"RECREATION\",CONCATENATE(Mardi!$A174&\" / \"&Mardi!$B174)&CHAR(10)&\"Matière : \"&Mardi!$D174&CHAR(10)&\"Compétences : \"&Mardi!$G174))","v":""},{"$f":"IF(AND(Mercredi!$D174=\"\",Mercredi!$G174=\"\"),\"\",IF(Mercredi!$D174=\"Récréation\",CONCATENATE(Mercredi!$A174&\" / \"&Mercredi!$B174)&CHAR(10)&\"RECREATION\",CONCATENATE(Mercredi!$A174&\" / \"&Mercredi!$B174)&CHAR(10)&\"Matière : \"&Mercredi!$D174&CHAR(10)&\"Compétences : \"&Mercredi!$G174))","v":""},{"$f":"IF(AND(Jeudi!$D174=\"\",Jeudi!$G174=\"\"),\"\",IF(Jeudi!$D174=\"Récréation\",CONCATENATE(Jeudi!$A174&\" / \"&Jeudi!$B174)&CHAR(10)&\"RECREATION\",CONCATENATE(Jeudi!$A174&\" / \"&Jeudi!$B174)&CHAR(10)&\"Matière : \"&Jeudi!$D174&CHAR(10)&\"Compétences : \"&Jeudi!$G174))","v":""},{"$f":"IF(AND(Vendredi!$D174=\"\",Vendredi!$G174=\"\"),\"\",IF(Vendredi!$D174=\"Récréation\",CONCATENATE(Vendredi!$A174&\" / \"&Vendredi!$B174)&CHAR(10)&\"RECREATION\",CONCATENATE(Vendredi!$A174&\" / \"&Vendredi!$B174)&CHAR(10)&\"Matière : \"&Vendredi!$D174&CHAR(10)&\"Compétences : \"&Vendredi!$G174))","v":""}]
[{"$f":"IF(AND(Lundi!$D175=\"\",Lundi!$G175=\"\"),\"\",IF(Lundi!$D175=\"Récréation\",CONCATENATE(Lundi!A175&\" / \"&Lundi!B175)&CHAR(10)&\"RECREATION\",CONCATENATE(Lundi!A175&\" / \"&Lundi!B175)&CHAR(10)&\"Matière : \"&Lundi!$D175&CHAR(10)&\"Compétences : \"&Lundi!$G175))","v":""},{"$f":"IF(AND(Mardi!$D175=\"\",Mardi!$G175=\"\"),\"\",IF(Mardi!$D175=\"Récréation\",CONCATENATE(Mardi!$A175&\" / \"&Mardi!$B175)&CHAR(10)&\"RECREATION\",CONCATENATE(Mardi!$A175&\" / \"&Mardi!$B175)&CHAR(10)&\"Matière : \"&Mardi!$D175&CHAR(10)&\"Compétences : \"&Mardi!$G175))","v":""},{"$f":"IF(AND(Mercredi!$D175=\"\",Mercredi!$G175=\"\"),\"\",IF(Mercredi!$D175=\"Récréation\",CONCATENATE(Mercredi!$A175&\" / \"&Mercredi!$B175)&CHAR(10)&\"RECREATION\",CONCATENATE(Mercredi!$A175&\" / \"&Mercredi!$B175)&CHAR(10)&\"Matière : \"&Mercredi!$D175&CHAR(10)&\"Compétences : \"&Mercredi!$G175))","v":""},{"$f":"IF(AND(Jeudi!$D175=\"\",Jeudi!$G175=\"\"),\"\",IF(Jeudi!$D175=\"Récréation\",CONCATENATE(Jeudi!$A175&\" / \"&Jeudi!$B175)&CHAR(10)&\"RECREATION\",CONCATENATE(Jeudi!$A175&\" / \"&Jeudi!$B175)&CHAR(10)&\"Matière : \"&Jeudi!$D175&CHAR(10)&\"Compétences : \"&Jeudi!$G175))","v":""},{"$f":"IF(AND(Vendredi!$D175=\"\",Vendredi!$G175=\"\"),\"\",IF(Vendredi!$D175=\"Récréation\",CONCATENATE(Vendredi!$A175&\" / \"&Vendredi!$B175)&CHAR(10)&\"RECREATION\",CONCATENATE(Vendredi!$A175&\" / \"&Vendredi!$B175)&CHAR(10)&\"Matière : \"&Vendredi!$D175&CHAR(10)&\"Compétences : \"&Vendredi!$G175))","v":""}]
[{"$f":"IF(AND(Lundi!$D176=\"\",Lundi!$G176=\"\"),\"\",IF(Lundi!$D176=\"Récréation\",CONCATENATE(Lundi!A176&\" / \"&Lundi!B176)&CHAR(10)&\"RECREATION\",CONCATENATE(Lundi!A176&\" / \"&Lundi!B176)&CHAR(10)&\"Matière : \"&Lundi!$D176&CHAR(10)&\"Compétences : \"&Lundi!$G176))","v":""},{"$f":"IF(AND(Mardi!$D176=\"\",Mardi!$G176=\"\"),\"\",IF(Mardi!$D176=\"Récréation\",CONCATENATE(Mardi!$A176&\" / \"&Mardi!$B176)&CHAR(10)&\"RECREATION\",CONCATENATE(Mardi!$A176&\" / \"&Mardi!$B176)&CHAR(10)&\"Matière : \"&Mardi!$D176&CHAR(10)&\"Compétences : \"&Mardi!$G176))","v":""},{"$f":"IF(AND(Mercredi!$D176=\"\",Mercredi!$G176=\"\"),\"\",IF(Mercredi!$D176=\"Récréation\",CONCATENATE(Mercredi!$A176&\" / \"&Mercredi!$B176)&CHAR(10)&\"RECREATION\",CONCATENATE(Mercredi!$A176&\" / \"&Mercredi!$B176)&CHAR(10)&\"Matière : \"&Mercredi!$D176&CHAR(10)&\"Compétences : \"&Mercredi!$G176))","v":""},{"$f":"IF(AND(Jeudi!$D176=\"\",Jeudi!$G176=\"\"),\"\",IF(Jeudi!$D176=\"Récréation\",CONCATENATE(Jeudi!$A176&\" / \"&Jeudi!$B176)&CHAR(10)&\"RECREATION\",CONCATENATE(Jeudi!$A176&\" / \"&Jeudi!$B176)&CHAR(10)&\"Matière : \"&Jeudi!$D176&CHAR(10)&\"Compétences : \"&Jeudi!$G176))","v":""},{"$f":"IF(AND(Vendredi!$D176=\"\",Vendredi!$G176=\"\"),\"\",IF(Vendredi!$D176=\"Récréation\",CONCATENATE(Vendredi!$A176&\" / \"&Vendredi!$B176)&CHAR(10)&\"RECREATION\",CONCATENATE(Vendredi!$A176&\" / \"&Vendredi!$B176)&CHAR(10)&\"Matière : \"&Vendredi!$D176&CHAR(10)&\"Compétences : \"&Vendredi!$G176))","v":""}]
[{"$f":"IF(AND(Lundi!$D177=\"\",Lundi!$G177=\"\"),\"\",IF(Lundi!$D177=\"Récréation\",CONCATENATE(Lundi!A177&\" / \"&Lundi!B177)&CHAR(10)&\"RECREATION\",CONCATENATE(Lundi!A177&\" / \"&Lundi!B177)&CHAR(10)&\"Matière : \"&Lundi!$D177&CHAR(10)&\"Compétences : \"&Lundi!$G177))","v":""},{"$f":"IF(AND(Mardi!$D177=\"\",Mardi!$G177=\"\"),\"\",IF(Mardi!$D177=\"Récréation\",CONCATENATE(Mardi!$A177&\" / \"&Mardi!$B177)&CHAR(10)&\"RECREATION\",CONCATENATE(Mardi!$A177&\" / \"&Mardi!$B177)&CHAR(10)&\"Matière : \"&Mardi!$D177&CHAR(10)&\"Compétences : \"&Mardi!$G177))","v":""},{"$f":"IF(AND(Mercredi!$D177=\"\",Mercredi!$G177=\"\"),\"\",IF(Mercredi!$D177=\"Récréation\",CONCATENATE(Mercredi!$A177&\" / \"&Mercredi!$B177)&CHAR(10)&\"RECREATION\",CONCATENATE(Mercredi!$A177&\" / \"&Mercredi!$B177)&CHAR(10)&\"Matière : \"&Mercredi!$D177&CHAR(10)&\"Compétences : \"&Mercredi!$G177))","v":""},{"$f":"IF(AND(Jeudi!$D177=\"\",Jeudi!$G177=\"\"),\"\",IF(Jeudi!$D177=\"Récréation\",CONCATENATE(Jeudi!$A177&\" / \"&Jeudi!$B177)&CHAR(10)&\"RECREATION\",CONCATENATE(Jeudi!$A177&\" / \"&Jeudi!$B177)&CHAR(10)&\"Matière : \"&Jeudi!$D177&CHAR(10)&\"Compétences : \"&Jeudi!$G177))","v":""},{"$f":"IF(AND(Vendredi!$D177=\"\",Vendredi!$G177=\"\"),\"\",IF(Vendredi!$D177=\"Récréation\",CONCATENATE(Vendredi!$A177&\" / \"&Vendredi!$B177)&CHAR(10)&\"RECREATION\",CONCATENATE(Vendredi!$A177&\" / \"&Vendredi!$B177)&CHAR(10)&\"Matière : \"&Vendredi!$D177&CHAR(10)&\"Compétences : \"&Vendredi!$G177))","v":""}]
[{"$f":"IF(AND(Lundi!$D178=\"\",Lundi!$G178=\"\"),\"\",IF(Lundi!$D178=\"Récréation\",CONCATENATE(Lundi!A178&\" / \"&Lundi!B178)&CHAR(10)&\"RECREATION\",CONCATENATE(Lundi!A178&\" / \"&Lundi!B178)&CHAR(10)&\"Matière : \"&Lundi!$D178&CHAR(10)&\"Compétences : \"&Lundi!$G178))","v":""},{"$f":"IF(AND(Mardi!$D178=\"\",Mardi!$G178=\"\"),\"\",IF(Mardi!$D178=\"Récréation\",CONCATENATE(Mardi!$A178&\" / \"&Mardi!$B178)&CHAR(10)&\"RECREATION\",CONCATENATE(Mardi!$A178&\" / \"&Mardi!$B178)&CHAR(10)&\"Matière : \"&Mardi!$D178&CHAR(10)&\"Compétences : \"&Mardi!$G178))","v":""},{"$f":"IF(AND(Mercredi!$D178=\"\",Mercredi!$G178=\"\"),\"\",IF(Mercredi!$D178=\"Récréation\",CONCATENATE(Mercredi!$A178&\" / \"&Mercredi!$B178)&CHAR(10)&\"RECREATION\",CONCATENATE(Mercredi!$A178&\" / \"&Mercredi!$B178)&CHAR(10)&\"Matière : \"&Mercredi!$D178&CHAR(10)&\"Compétences : \"&Mercredi!$G178))","v":""},{"$f":"IF(AND(Jeudi!$D178=\"\",Jeudi!$G178=\"\"),\"\",IF(Jeudi!$D178=\"Récréation\",CONCATENATE(Jeudi!$A178&\" / \"&Jeudi!$B178)&CHAR(10)&\"RECREATION\",CONCATENATE(Jeudi!$A178&\" / \"&Jeudi!$B178)&CHAR(10)&\"Matière : \"&Jeudi!$D178&CHAR(10)&\"Compétences : \"&Jeudi!$G178))","v":""},{"$f":"IF(AND(Vendredi!$D178=\"\",Vendredi!$G178=\"\"),\"\",IF(Vendredi!$D178=\"Récréation\",CONCATENATE(Vendredi!$A178&\" / \"&Vendredi!$B178)&CHAR(10)&\"RECREATION\",CONCATENATE(Vendredi!$A178&\" / \"&Vendredi!$B178)&CHAR(10)&\"Matière : \"&Vendredi!$D178&CHAR(10)&\"Compétences : \"&Vendredi!$G178))","v":""}]
[{"$f":"IF(AND(Lundi!$D179=\"\",Lundi!$G179=\"\"),\"\",IF(Lundi!$D179=\"Récréation\",CONCATENATE(Lundi!A179&\" / \"&Lundi!B179)&CHAR(10)&\"RECREATION\",CONCATENATE(Lundi!A179&\" / \"&Lundi!B179)&CHAR(10)&\"Matière : \"&Lundi!$D179&CHAR(10)&\"Compétences : \"&Lundi!$G179))","v":""},{"$f":"IF(AND(Mardi!$D179=\"\",Mardi!$G179=\"\"),\"\",IF(Mardi!$D179=\"Récréation\",CONCATENATE(Mardi!$A179&\" / \"&Mardi!$B179)&CHAR(10)&\"RECREATION\",CONCATENATE(Mardi!$A179&\" / \"&Mardi!$B179)&CHAR(10)&\"Matière : \"&Mardi!$D179&CHAR(10)&\"Compétences : \"&Mardi!$G179))","v":""},{"$f":"IF(AND(Mercredi!$D179=\"\",Mercredi!$G179=\"\"),\"\",IF(Mercredi!$D179=\"Récréation\",CONCATENATE(Mercredi!$A179&\" / \"&Mercredi!$B179)&CHAR(10)&\"RECREATION\",CONCATENATE(Mercredi!$A179&\" / \"&Mercredi!$B179)&CHAR(10)&\"Matière : \"&Mercredi!$D179&CHAR(10)&\"Compétences : \"&Mercredi!$G179))","v":""},{"$f":"IF(AND(Jeudi!$D179=\"\",Jeudi!$G179=\"\"),\"\",IF(Jeudi!$D179=\"Récréation\",CONCATENATE(Jeudi!$A179&\" / \"&Jeudi!$B179)&CHAR(10)&\"RECREATION\",CONCATENATE(Jeudi!$A179&\" / \"&Jeudi!$B179)&CHAR(10)&\"Matière : \"&Jeudi!$D179&CHAR(10)&\"Compétences : \"&Jeudi!$G179))","v":""},{"$f":"IF(AND(Vendredi!$D179=\"\",Vendredi!$G179=\"\"),\"\",IF(Vendredi!$D179=\"Récréation\",CONCATENATE(Vendredi!$A179&\" / \"&Vendredi!$B179)&CHAR(10)&\"RECREATION\",CONCATENATE(Vendredi!$A179&\" / \"&Vendredi!$B179)&CHAR(10)&\"Matière : \"&Vendredi!$D179&CHAR(10)&\"Compétences : \"&Vendredi!$G179))","v":""}]
[{"$f":"IF(AND(Lundi!$D180=\"\",Lundi!$G180=\"\"),\"\",IF(Lundi!$D180=\"Récréation\",CONCATENATE(Lundi!A180&\" / \"&Lundi!B180)&CHAR(10)&\"RECREATION\",CONCATENATE(Lundi!A180&\" / \"&Lundi!B180)&CHAR(10)&\"Matière : \"&Lundi!$D180&CHAR(10)&\"Compétences : \"&Lundi!$G180))","v":""},{"$f":"IF(AND(Mardi!$D180=\"\",Mardi!$G180=\"\"),\"\",IF(Mardi!$D180=\"Récréation\",CONCATENATE(Mardi!$A180&\" / \"&Mardi!$B180)&CHAR(10)&\"RECREATION\",CONCATENATE(Mardi!$A180&\" / \"&Mardi!$B180)&CHAR(10)&\"Matière : \"&Mardi!$D180&CHAR(10)&\"Compétences : \"&Mardi!$G180))","v":""},{"$f":"IF(AND(Mercredi!$D180=\"\",Mercredi!$G180=\"\"),\"\",IF(Mercredi!$D180=\"Récréation\",CONCATENATE(Mercredi!$A180&\" / \"&Mercredi!$B180)&CHAR(10)&\"RECREATION\",CONCATENATE(Mercredi!$A180&\" / \"&Mercredi!$B180)&CHAR(10)&\"Matière : \"&Mercredi!$D180&CHAR(10)&\"Compétences : \"&Mercredi!$G180))","v":""},{"$f":"IF(AND(Jeudi!$D180=\"\",Jeudi!$G180=\"\"),\"\",IF(Jeudi!$D180=\"Récréation\",CONCATENATE(Jeudi!$A180&\" / \"&Jeudi!$B180)&CHAR(10)&\"RECREATION\",CONCATENATE(Jeudi!$A180&\" / \"&Jeudi!$B180)&CHAR(10)&\"Matière : \"&Jeudi!$D180&CHAR(10)&\"Compétences : \"&Jeudi!$G180))","v":""},{"$f":"IF(AND(Vendredi!$D180=\"\",Vendredi!$G180=\"\"),\"\",IF(Vendredi!$D180=\"Récréation\",CONCATENATE(Vendredi!$A180&\" / \"&Vendredi!$B180)&CHAR(10)&\"RECREATION\",CONCATENATE(Vendredi!$A180&\" / \"&Vendredi!$B180)&CHAR(10)&\"Matière : \"&Vendredi!$D180&CHAR(10)&\"Compétences : \"&Vendredi!$G180))","v":""}]
[{"$f":"IF(AND(Lundi!$D181=\"\",Lundi!$G181=\"\"),\"\",IF(Lundi!$D181=\"Récréation\",CONCATENATE(Lundi!A181&\" / \"&Lundi!B181)&CHAR(10)&\"RECREATION\",CONCATENATE(Lundi!A181&\" / \"&Lundi!B181)&CHAR(10)&\"Matière : \"&Lundi!$D181&CHAR(10)&\"Compétences : \"&Lundi!$G181))","v":""},{"$f":"IF(AND(Mardi!$D181=\"\",Mardi!$G181=\"\"),\"\",IF(Mardi!$D181=\"Récréation\",CONCATENATE(Mardi!$A181&\" / \"&Mardi!$B181)&CHAR(10)&\"RECREATION\",CONCATENATE(Mardi!$A181&\" / \"&Mardi!$B181)&CHAR(10)&\"Matière : \"&Mardi!$D181&CHAR(10)&\"Compétences : \"&Mardi!$G181))","v":""},{"$f":"IF(AND(Mercredi!$D181=\"\",Mercredi!$G181=\"\"),\"\",IF(Mercredi!$D181=\"Récréation\",CONCATENATE(Mercredi!$A181&\" / \"&Mercredi!$B181)&CHAR(10)&\"RECREATION\",CONCATENATE(Mercredi!$A181&\" / \"&Mercredi!$B181)&CHAR(10)&\"Matière : \"&Mercredi!$D181&CHAR(10)&\"Compétences : \"&Mercredi!$G181))","v":""},{"$f":"IF(AND(Jeudi!$D181=\"\",Jeudi!$G181=\"\"),\"\",IF(Jeudi!$D181=\"Récréation\",CONCATENATE(Jeudi!$A181&\" / \"&Jeudi!$B181)&CHAR(10)&\"RECREATION\",CONCATENATE(Jeudi!$A181&\" / \"&Jeudi!$B181)&CHAR(10)&\"Matière : \"&Jeudi!$D181&CHAR(10)&\"Compétences : \"&Jeudi!$G181))","v":""},{"$f":"IF(AND(Vendredi!$D181=\"\",Vendredi!$G181=\"\"),\"\",IF(Vendredi!$D181=\"Récréation\",CONCATENATE(Vendredi!$A181&\" / \"&Vendredi!$B181)&CHAR(10)&\"RECREATION\",CONCATENATE(Vendredi!$A181&\" / \"&Vendredi!$B181)&CHAR(10)&\"Matière : \"&Vendredi!$D181&CHAR(10)&\"Compétences : \"&Vendredi!$G181))","v":""}]
[{"$f":"IF(AND(Lundi!$D182=\"\",Lundi!$G182=\"\"),\"\",IF(Lundi!$D182=\"Récréation\",CONCATENATE(Lundi!A182&\" / \"&Lundi!B182)&CHAR(10)&\"RECREATION\",CONCATENATE(Lundi!A182&\" / \"&Lundi!B182)&CHAR(10)&\"Matière : \"&Lundi!$D182&CHAR(10)&\"Compétences : \"&Lundi!$G182))","v":""},{"$f":"IF(AND(Mardi!$D182=\"\",Mardi!$G182=\"\"),\"\",IF(Mardi!$D182=\"Récréation\",CONCATENATE(Mardi!$A182&\" / \"&Mardi!$B182)&CHAR(10)&\"RECREATION\",CONCATENATE(Mardi!$A182&\" / \"&Mardi!$B182)&CHAR(10)&\"Matière : \"&Mardi!$D182&CHAR(10)&\"Compétences : \"&Mardi!$G182))","v":""},{"$f":"IF(AND(Mercredi!$D182=\"\",Mercredi!$G182=\"\"),\"\",IF(Mercredi!$D182=\"Récréation\",CONCATENATE(Mercredi!$A182&\" / \"&Mercredi!$B182)&CHAR(10)&\"RECREATION\",CONCATENATE(Mercredi!$A182&\" / \"&Mercredi!$B182)&CHAR(10)&\"Matière : \"&Mercredi!$D182&CHAR(10)&\"Compétences : \"&Mercredi!$G182))","v":""},{"$f":"IF(AND(Jeudi!$D182=\"\",Jeudi!$G182=\"\"),\"\",IF(Jeudi!$D182=\"Récréation\",CONCATENATE(Jeudi!$A182&\" / \"&Jeudi!$B182)&CHAR(10)&\"RECREATION\",CONCATENATE(Jeudi!$A182&\" / \"&Jeudi!$B182)&CHAR(10)&\"Matière : \"&Jeudi!$D182&CHAR(10)&\"Compétences : \"&Jeudi!$G182))","v":""},{"$f":"IF(AND(Vendredi!$D182=\"\",Vendredi!$G182=\"\"),\"\",IF(Vendredi!$D182=\"Récréation\",CONCATENATE(Vendredi!$A182&\" / \"&Vendredi!$B182)&CHAR(10)&\"RECREATION\",CONCATENATE(Vendredi!$A182&\" / \"&Vendredi!$B182)&CHAR(10)&\"Matière : \"&Vendredi!$D182&CHAR(10)&\"Compétences : \"&Vendredi!$G182))","v":""}]
[{"$f":"IF(AND(Lundi!$D183=\"\",Lundi!$G183=\"\"),\"\",IF(Lundi!$D183=\"Récréation\",CONCATENATE(Lundi!A183&\" / \"&Lundi!B183)&CHAR(10)&\"RECREATION\",CONCATENATE(Lundi!A183&\" / \"&Lundi!B183)&CHAR(10)&\"Matière : \"&Lundi!$D183&CHAR(10)&\"Compétences : \"&Lundi!$G183))","v":""},{"$f":"IF(AND(Mardi!$D183=\"\",Mardi!$G183=\"\"),\"\",IF(Mardi!$D183=\"Récréation\",CONCATENATE(Mardi!$A183&\" / \"&Mardi!$B183)&CHAR(10)&\"RECREATION\",CONCATENATE(Mardi!$A183&\" / \"&Mardi!$B183)&CHAR(10)&\"Matière : \"&Mardi!$D183&CHAR(10)&\"Compétences : \"&Mardi!$G183))","v":""},{"$f":"IF(AND(Mercredi!$D183=\"\",Mercredi!$G183=\"\"),\"\",IF(Mercredi!$D183=\"Récréation\",CONCATENATE(Mercredi!$A183&\" / \"&Mercredi!$B183)&CHAR(10)&\"RECREATION\",CONCATENATE(Mercredi!$A183&\" / \"&Mercredi!$B183)&CHAR(10)&\"Matière : \"&Mercredi!$D183&CHAR(10)&\"Compétences : \"&Mercredi!$G183))","v":""},{"$f":"IF(AND(Jeudi!$D183=\"\",Jeudi!$G183=\"\"),\"\",IF(Jeudi!$D183=\"Récréation\",CONCATENATE(Jeudi!$A183&\" / \"&Jeudi!$B183)&CHAR(10)&\"RECREATION\",CONCATENATE(Jeudi!$A183&\" / \"&Jeudi!$B183)&CHAR(10)&\"Matière : \"&Jeudi!$D183&CHAR(10)&\"Compétences : \"&Jeudi!$G183))","v":""},{"$f":"IF(AND(Vendredi!$D183=\"\",Vendredi!$G183=\"\"),\"\",IF(Vendredi!$D183=\"Récréation\",CONCATENATE(Vendredi!$A183&\" / \"&Vendredi!$B183)&CHAR(10)&\"RECREATION\",CONCATENATE(Vendredi!$A183&\" / \"&Vendredi!$B183)&CHAR(10)&\"Matière : \"&Vendredi!$D183&CHAR(10)&\"Compétences : \"&Vendredi!$G183))","v":""}]
[{"$f":"IF(AND(Lundi!$D184=\"\",Lundi!$G184=\"\"),\"\",IF(Lundi!$D184=\"Récréation\",CONCATENATE(Lundi!A184&\" / \"&Lundi!B184)&CHAR(10)&\"RECREATION\",CONCATENATE(Lundi!A184&\" / \"&Lundi!B184)&CHAR(10)&\"Matière : \"&Lundi!$D184&CHAR(10)&\"Compétences : \"&Lundi!$G184))","v":""},{"$f":"IF(AND(Mardi!$D184=\"\",Mardi!$G184=\"\"),\"\",IF(Mardi!$D184=\"Récréation\",CONCATENATE(Mardi!$A184&\" / \"&Mardi!$B184)&CHAR(10)&\"RECREATION\",CONCATENATE(Mardi!$A184&\" / \"&Mardi!$B184)&CHAR(10)&\"Matière : \"&Mardi!$D184&CHAR(10)&\"Compétences : \"&Mardi!$G184))","v":""},{"$f":"IF(AND(Mercredi!$D184=\"\",Mercredi!$G184=\"\"),\"\",IF(Mercredi!$D184=\"Récréation\",CONCATENATE(Mercredi!$A184&\" / \"&Mercredi!$B184)&CHAR(10)&\"RECREATION\",CONCATENATE(Mercredi!$A184&\" / \"&Mercredi!$B184)&CHAR(10)&\"Matière : \"&Mercredi!$D184&CHAR(10)&\"Compétences : \"&Mercredi!$G184))","v":""},{"$f":"IF(AND(Jeudi!$D184=\"\",Jeudi!$G184=\"\"),\"\",IF(Jeudi!$D184=\"Récréation\",CONCATENATE(Jeudi!$A184&\" / \"&Jeudi!$B184)&CHAR(10)&\"RECREATION\",CONCATENATE(Jeudi!$A184&\" / \"&Jeudi!$B184)&CHAR(10)&\"Matière : \"&Jeudi!$D184&CHAR(10)&\"Compétences : \"&Jeudi!$G184))","v":""},{"$f":"IF(AND(Vendredi!$D184=\"\",Vendredi!$G184=\"\"),\"\",IF(Vendredi!$D184=\"Récréation\",CONCATENATE(Vendredi!$A184&\" / \"&Vendredi!$B184)&CHAR(10)&\"RECREATION\",CONCATENATE(Vendredi!$A184&\" / \"&Vendredi!$B184)&CHAR(10)&\"Matière : \"&Vendredi!$D184&CHAR(10)&\"Compétences : \"&Vendredi!$G184))","v":""}]
[{"$f":"IF(AND(Lundi!$D185=\"\",Lundi!$G185=\"\"),\"\",IF(Lundi!$D185=\"Récréation\",CONCATENATE(Lundi!A185&\" / \"&Lundi!B185)&CHAR(10)&\"RECREATION\",CONCATENATE(Lundi!A185&\" / \"&Lundi!B185)&CHAR(10)&\"Matière : \"&Lundi!$D185&CHAR(10)&\"Compétences : \"&Lundi!$G185))","v":""},{"$f":"IF(AND(Mardi!$D185=\"\",Mardi!$G185=\"\"),\"\",IF(Mardi!$D185=\"Récréation\",CONCATENATE(Mardi!$A185&\" / \"&Mardi!$B185)&CHAR(10)&\"RECREATION\",CONCATENATE(Mardi!$A185&\" / \"&Mardi!$B185)&CHAR(10)&\"Matière : \"&Mardi!$D185&CHAR(10)&\"Compétences : \"&Mardi!$G185))","v":""},{"$f":"IF(AND(Mercredi!$D185=\"\",Mercredi!$G185=\"\"),\"\",IF(Mercredi!$D185=\"Récréation\",CONCATENATE(Mercredi!$A185&\" / \"&Mercredi!$B185)&CHAR(10)&\"RECREATION\",CONCATENATE(Mercredi!$A185&\" / \"&Mercredi!$B185)&CHAR(10)&\"Matière : \"&Mercredi!$D185&CHAR(10)&\"Compétences : \"&Mercredi!$G185))","v":""},{"$f":"IF(AND(Jeudi!$D185=\"\",Jeudi!$G185=\"\"),\"\",IF(Jeudi!$D185=\"Récréation\",CONCATENATE(Jeudi!$A185&\" / \"&Jeudi!$B185)&CHAR(10)&\"RECREATION\",CONCATENATE(Jeudi!$A185&\" / \"&Jeudi!$B185)&CHAR(10)&\"Matière : \"&Jeudi!$D185&CHAR(10)&\"Compétences : \"&Jeudi!$G185))","v":""},{"$f":"IF(AND(Vendredi!$D185=\"\",Vendredi!$G185=\"\"),\"\",IF(Vendredi!$D185=\"Récréation\",CONCATENATE(Vendredi!$A185&\" / \"&Vendredi!$B185)&CHAR(10)&\"RECREATION\",CONCATENATE(Vendredi!$A185&\" / \"&Vendredi!$B185)&CHAR(10)&\"Matière : \"&Vendredi!$D185&CHAR(10)&\"Compétences : \"&Vendredi!$G185))","v":""}]
[{"$f":"IF(AND(Lundi!$D186=\"\",Lundi!$G186=\"\"),\"\",IF(Lundi!$D186=\"Récréation\",CONCATENATE(Lundi!A186&\" / \"&Lundi!B186)&CHAR(10)&\"RECREATION\",CONCATENATE(Lundi!A186&\" / \"&Lundi!B186)&CHAR(10)&\"Matière : \"&Lundi!$D186&CHAR(10)&\"Compétences : \"&Lundi!$G186))","v":""},{"$f":"IF(AND(Mardi!$D186=\"\",Mardi!$G186=\"\"),\"\",IF(Mardi!$D186=\"Récréation\",CONCATENATE(Mardi!$A186&\" / \"&Mardi!$B186)&CHAR(10)&\"RECREATION\",CONCATENATE(Mardi!$A186&\" / \"&Mardi!$B186)&CHAR(10)&\"Matière : \"&Mardi!$D186&CHAR(10)&\"Compétences : \"&Mardi!$G186))","v":""},{"$f":"IF(AND(Mercredi!$D186=\"\",Mercredi!$G186=\"\"),\"\",IF(Mercredi!$D186=\"Récréation\",CONCATENATE(Mercredi!$A186&\" / \"&Mercredi!$B186)&CHAR(10)&\"RECREATION\",CONCATENATE(Mercredi!$A186&\" / \"&Mercredi!$B186)&CHAR(10)&\"Matière : \"&Mercredi!$D186&CHAR(10)&\"Compétences : \"&Mercredi!$G186))","v":""},{"$f":"IF(AND(Jeudi!$D186=\"\",Jeudi!$G186=\"\"),\"\",IF(Jeudi!$D186=\"Récréation\",CONCATENATE(Jeudi!$A186&\" / \"&Jeudi!$B186)&CHAR(10)&\"RECREATION\",CONCATENATE(Jeudi!$A186&\" / \"&Jeudi!$B186)&CHAR(10)&\"Matière : \"&Jeudi!$D186&CHAR(10)&\"Compétences : \"&Jeudi!$G186))","v":""},{"$f":"IF(AND(Vendredi!$D186=\"\",Vendredi!$G186=\"\"),\"\",IF(Vendredi!$D186=\"Récréation\",CONCATENATE(Vendredi!$A186&\" / \"&Vendredi!$B186)&CHAR(10)&\"RECREATION\",CONCATENATE(Vendredi!$A186&\" / \"&Vendredi!$B186)&CHAR(10)&\"Matière : \"&Vendredi!$D186&CHAR(10)&\"Compétences : \"&Vendredi!$G186))","v":""}]
[{"$f":"IF(AND(Lundi!$D187=\"\",Lundi!$G187=\"\"),\"\",IF(Lundi!$D187=\"Récréation\",CONCATENATE(Lundi!A187&\" / \"&Lundi!B187)&CHAR(10)&\"RECREATION\",CONCATENATE(Lundi!A187&\" / \"&Lundi!B187)&CHAR(10)&\"Matière : \"&Lundi!$D187&CHAR(10)&\"Compétences : \"&Lundi!$G187))","v":""},{"$f":"IF(AND(Mardi!$D187=\"\",Mardi!$G187=\"\"),\"\",IF(Mardi!$D187=\"Récréation\",CONCATENATE(Mardi!$A187&\" / \"&Mardi!$B187)&CHAR(10)&\"RECREATION\",CONCATENATE(Mardi!$A187&\" / \"&Mardi!$B187)&CHAR(10)&\"Matière : \"&Mardi!$D187&CHAR(10)&\"Compétences : \"&Mardi!$G187))","v":""},{"$f":"IF(AND(Mercredi!$D187=\"\",Mercredi!$G187=\"\"),\"\",IF(Mercredi!$D187=\"Récréation\",CONCATENATE(Mercredi!$A187&\" / \"&Mercredi!$B187)&CHAR(10)&\"RECREATION\",CONCATENATE(Mercredi!$A187&\" / \"&Mercredi!$B187)&CHAR(10)&\"Matière : \"&Mercredi!$D187&CHAR(10)&\"Compétences : \"&Mercredi!$G187))","v":""},{"$f":"IF(AND(Jeudi!$D187=\"\",Jeudi!$G187=\"\"),\"\",IF(Jeudi!$D187=\"Récréation\",CONCATENATE(Jeudi!$A187&\" / \"&Jeudi!$B187)&CHAR(10)&\"RECREATION\",CONCATENATE(Jeudi!$A187&\" / \"&Jeudi!$B187)&CHAR(10)&\"Matière : \"&Jeudi!$D187&CHAR(10)&\"Compétences : \"&Jeudi!$G187))","v":""},{"$f":"IF(AND(Vendredi!$D187=\"\",Vendredi!$G187=\"\"),\"\",IF(Vendredi!$D187=\"Récréation\",CONCATENATE(Vendredi!$A187&\" / \"&Vendredi!$B187)&CHAR(10)&\"RECREATION\",CONCATENATE(Vendredi!$A187&\" / \"&Vendredi!$B187)&CHAR(10)&\"Matière : \"&Vendredi!$D187&CHAR(10)&\"Compétences : \"&Vendredi!$G187))","v":""}]
[{"$f":"IF(AND(Lundi!$D188=\"\",Lundi!$G188=\"\"),\"\",IF(Lundi!$D188=\"Récréation\",CONCATENATE(Lundi!A188&\" / \"&Lundi!B188)&CHAR(10)&\"RECREATION\",CONCATENATE(Lundi!A188&\" / \"&Lundi!B188)&CHAR(10)&\"Matière : \"&Lundi!$D188&CHAR(10)&\"Compétences : \"&Lundi!$G188))","v":""},{"$f":"IF(AND(Mardi!$D188=\"\",Mardi!$G188=\"\"),\"\",IF(Mardi!$D188=\"Récréation\",CONCATENATE(Mardi!$A188&\" / \"&Mardi!$B188)&CHAR(10)&\"RECREATION\",CONCATENATE(Mardi!$A188&\" / \"&Mardi!$B188)&CHAR(10)&\"Matière : \"&Mardi!$D188&CHAR(10)&\"Compétences : \"&Mardi!$G188))","v":""},{"$f":"IF(AND(Mercredi!$D188=\"\",Mercredi!$G188=\"\"),\"\",IF(Mercredi!$D188=\"Récréation\",CONCATENATE(Mercredi!$A188&\" / \"&Mercredi!$B188)&CHAR(10)&\"RECREATION\",CONCATENATE(Mercredi!$A188&\" / \"&Mercredi!$B188)&CHAR(10)&\"Matière : \"&Mercredi!$D188&CHAR(10)&\"Compétences : \"&Mercredi!$G188))","v":""},{"$f":"IF(AND(Jeudi!$D188=\"\",Jeudi!$G188=\"\"),\"\",IF(Jeudi!$D188=\"Récréation\",CONCATENATE(Jeudi!$A188&\" / \"&Jeudi!$B188)&CHAR(10)&\"RECREATION\",CONCATENATE(Jeudi!$A188&\" / \"&Jeudi!$B188)&CHAR(10)&\"Matière : \"&Jeudi!$D188&CHAR(10)&\"Compétences : \"&Jeudi!$G188))","v":""},{"$f":"IF(AND(Vendredi!$D188=\"\",Vendredi!$G188=\"\"),\"\",IF(Vendredi!$D188=\"Récréation\",CONCATENATE(Vendredi!$A188&\" / \"&Vendredi!$B188)&CHAR(10)&\"RECREATION\",CONCATENATE(Vendredi!$A188&\" / \"&Vendredi!$B188)&CHAR(10)&\"Matière : \"&Vendredi!$D188&CHAR(10)&\"Compétences : \"&Vendredi!$G188))","v":""}]
[{"$f":"IF(AND(Lundi!$D189=\"\",Lundi!$G189=\"\"),\"\",IF(Lundi!$D189=\"Récréation\",CONCATENATE(Lundi!A189&\" / \"&Lundi!B189)&CHAR(10)&\"RECREATION\",CONCATENATE(Lundi!A189&\" / \"&Lundi!B189)&CHAR(10)&\"Matière : \"&Lundi!$D189&CHAR(10)&\"Compétences : \"&Lundi!$G189))","v":""},{"$f":"IF(AND(Mardi!$D189=\"\",Mardi!$G189=\"\"),\"\",IF(Mardi!$D189=\"Récréation\",CONCATENATE(Mardi!$A189&\" / \"&Mardi!$B189)&CHAR(10)&\"RECREATION\",CONCATENATE(Mardi!$A189&\" / \"&Mardi!$B189)&CHAR(10)&\"Matière : \"&Mardi!$D189&CHAR(10)&\"Compétences : \"&Mardi!$G189))","v":""},{"$f":"IF(AND(Mercredi!$D189=\"\",Mercredi!$G189=\"\"),\"\",IF(Mercredi!$D189=\"Récréation\",CONCATENATE(Mercredi!$A189&\" / \"&Mercredi!$B189)&CHAR(10)&\"RECREATION\",CONCATENATE(Mercredi!$A189&\" / \"&Mercredi!$B189)&CHAR(10)&\"Matière : \"&Mercredi!$D189&CHAR(10)&\"Compétences : \"&Mercredi!$G189))","v":""},{"$f":"IF(AND(Jeudi!$D189=\"\",Jeudi!$G189=\"\"),\"\",IF(Jeudi!$D189=\"Récréation\",CONCATENATE(Jeudi!$A189&\" / \"&Jeudi!$B189)&CHAR(10)&\"RECREATION\",CONCATENATE(Jeudi!$A189&\" / \"&Jeudi!$B189)&CHAR(10)&\"Matière : \"&Jeudi!$D189&CHAR(10)&\"Compétences : \"&Jeudi!$G189))","v":""},{"$f":"IF(AND(Vendredi!$D189=\"\",Vendredi!$G189=\"\"),\"\",IF(Vendredi!$D189=\"Récréation\",CONCATENATE(Vendredi!$A189&\" / \"&Vendredi!$B189)&CHAR(10)&\"RECREATION\",CONCATENATE(Vendredi!$A189&\" / \"&Vendredi!$B189)&CHAR(10)&\"Matière : \"&Vendredi!$D189&CHAR(10)&\"Compétences : \"&Vendredi!$G189))","v":""}]
[{"$f":"IF(AND(Lundi!$D190=\"\",Lundi!$G190=\"\"),\"\",IF(Lundi!$D190=\"Récréation\",CONCATENATE(Lundi!A190&\" / \"&Lundi!B190)&CHAR(10)&\"RECREATION\",CONCATENATE(Lundi!A190&\" / \"&Lundi!B190)&CHAR(10)&\"Matière : \"&Lundi!$D190&CHAR(10)&\"Compétences : \"&Lundi!$G190))","v":""},{"$f":"IF(AND(Mardi!$D190=\"\",Mardi!$G190=\"\"),\"\",IF(Mardi!$D190=\"Récréation\",CONCATENATE(Mardi!$A190&\" / \"&Mardi!$B190)&CHAR(10)&\"RECREATION\",CONCATENATE(Mardi!$A190&\" / \"&Mardi!$B190)&CHAR(10)&\"Matière : \"&Mardi!$D190&CHAR(10)&\"Compétences : \"&Mardi!$G190))","v":""},{"$f":"IF(AND(Mercredi!$D190=\"\",Mercredi!$G190=\"\"),\"\",IF(Mercredi!$D190=\"Récréation\",CONCATENATE(Mercredi!$A190&\" / \"&Mercredi!$B190)&CHAR(10)&\"RECREATION\",CONCATENATE(Mercredi!$A190&\" / \"&Mercredi!$B190)&CHAR(10)&\"Matière : \"&Mercredi!$D190&CHAR(10)&\"Compétences : \"&Mercredi!$G190))","v":""},{"$f":"IF(AND(Jeudi!$D190=\"\",Jeudi!$G190=\"\"),\"\",IF(Jeudi!$D190=\"Récréation\",CONCATENATE(Jeudi!$A190&\" / \"&Jeudi!$B190)&CHAR(10)&\"RECREATION\",CONCATENATE(Jeudi!$A190&\" / \"&Jeudi!$B190)&CHAR(10)&\"Matière : \"&Jeudi!$D190&CHAR(10)&\"Compétences : \"&Jeudi!$G190))","v":""},{"$f":"IF(AND(Vendredi!$D190=\"\",Vendredi!$G190=\"\"),\"\",IF(Vendredi!$D190=\"Récréation\",CONCATENATE(Vendredi!$A190&\" / \"&Vendredi!$B190)&CHAR(10)&\"RECREATION\",CONCATENATE(Vendredi!$A190&\" / \"&Vendredi!$B190)&CHAR(10)&\"Matière : \"&Vendredi!$D190&CHAR(10)&\"Compétences : \"&Vendredi!$G190))","v":""}]
[{"$f":"IF(AND(Lundi!$D191=\"\",Lundi!$G191=\"\"),\"\",IF(Lundi!$D191=\"Récréation\",CONCATENATE(Lundi!A191&\" / \"&Lundi!B191)&CHAR(10)&\"RECREATION\",CONCATENATE(Lundi!A191&\" / \"&Lundi!B191)&CHAR(10)&\"Matière : \"&Lundi!$D191&CHAR(10)&\"Compétences : \"&Lundi!$G191))","v":""},{"$f":"IF(AND(Mardi!$D191=\"\",Mardi!$G191=\"\"),\"\",IF(Mardi!$D191=\"Récréation\",CONCATENATE(Mardi!$A191&\" / \"&Mardi!$B191)&CHAR(10)&\"RECREATION\",CONCATENATE(Mardi!$A191&\" / \"&Mardi!$B191)&CHAR(10)&\"Matière : \"&Mardi!$D191&CHAR(10)&\"Compétences : \"&Mardi!$G191))","v":""},{"$f":"IF(AND(Mercredi!$D191=\"\",Mercredi!$G191=\"\"),\"\",IF(Mercredi!$D191=\"Récréation\",CONCATENATE(Mercredi!$A191&\" / \"&Mercredi!$B191)&CHAR(10)&\"RECREATION\",CONCATENATE(Mercredi!$A191&\" / \"&Mercredi!$B191)&CHAR(10)&\"Matière : \"&Mercredi!$D191&CHAR(10)&\"Compétences : \"&Mercredi!$G191))","v":""},{"$f":"IF(AND(Jeudi!$D191=\"\",Jeudi!$G191=\"\"),\"\",IF(Jeudi!$D191=\"Récréation\",CONCATENATE(Jeudi!$A191&\" / \"&Jeudi!$B191)&CHAR(10)&\"RECREATION\",CONCATENATE(Jeudi!$A191&\" / \"&Jeudi!$B191)&CHAR(10)&\"Matière : \"&Jeudi!$D191&CHAR(10)&\"Compétences : \"&Jeudi!$G191))","v":""},{"$f":"IF(AND(Vendredi!$D191=\"\",Vendredi!$G191=\"\"),\"\",IF(Vendredi!$D191=\"Récréation\",CONCATENATE(Vendredi!$A191&\" / \"&Vendredi!$B191)&CHAR(10)&\"RECREATION\",CONCATENATE(Vendredi!$A191&\" / \"&Vendredi!$B191)&CHAR(10)&\"Matière : \"&Vendredi!$D191&CHAR(10)&\"Compétences : \"&Vendredi!$G191))","v":""}]
[{"$f":"IF(AND(Lundi!$D192=\"\",Lundi!$G192=\"\"),\"\",IF(Lundi!$D192=\"Récréation\",CONCATENATE(Lundi!A192&\" / \"&Lundi!B192)&CHAR(10)&\"RECREATION\",CONCATENATE(Lundi!A192&\" / \"&Lundi!B192)&CHAR(10)&\"Matière : \"&Lundi!$D192&CHAR(10)&\"Compétences : \"&Lundi!$G192))","v":""},{"$f":"IF(AND(Mardi!$D192=\"\",Mardi!$G192=\"\"),\"\",IF(Mardi!$D192=\"Récréation\",CONCATENATE(Mardi!$A192&\" / \"&Mardi!$B192)&CHAR(10)&\"RECREATION\",CONCATENATE(Mardi!$A192&\" / \"&Mardi!$B192)&CHAR(10)&\"Matière : \"&Mardi!$D192&CHAR(10)&\"Compétences : \"&Mardi!$G192))","v":""},{"$f":"IF(AND(Mercredi!$D192=\"\",Mercredi!$G192=\"\"),\"\",IF(Mercredi!$D192=\"Récréation\",CONCATENATE(Mercredi!$A192&\" / \"&Mercredi!$B192)&CHAR(10)&\"RECREATION\",CONCATENATE(Mercredi!$A192&\" / \"&Mercredi!$B192)&CHAR(10)&\"Matière : \"&Mercredi!$D192&CHAR(10)&\"Compétences : \"&Mercredi!$G192))","v":""},{"$f":"IF(AND(Jeudi!$D192=\"\",Jeudi!$G192=\"\"),\"\",IF(Jeudi!$D192=\"Récréation\",CONCATENATE(Jeudi!$A192&\" / \"&Jeudi!$B192)&CHAR(10)&\"RECREATION\",CONCATENATE(Jeudi!$A192&\" / \"&Jeudi!$B192)&CHAR(10)&\"Matière : \"&Jeudi!$D192&CHAR(10)&\"Compétences : \"&Jeudi!$G192))","v":""},{"$f":"IF(AND(Vendredi!$D192=\"\",Vendredi!$G192=\"\"),\"\",IF(Vendredi!$D192=\"Récréation\",CONCATENATE(Vendredi!$A192&\" / \"&Vendredi!$B192)&CHAR(10)&\"RECREATION\",CONCATENATE(Vendredi!$A192&\" / \"&Vendredi!$B192)&CHAR(10)&\"Matière : \"&Vendredi!$D192&CHAR(10)&\"Compétences : \"&Vendredi!$G192))","v":""}]
[{"$f":"IF(AND(Lundi!$D193=\"\",Lundi!$G193=\"\"),\"\",IF(Lundi!$D193=\"Récréation\",CONCATENATE(Lundi!A193&\" / \"&Lundi!B193)&CHAR(10)&\"RECREATION\",CONCATENATE(Lundi!A193&\" / \"&Lundi!B193)&CHAR(10)&\"Matière : \"&Lundi!$D193&CHAR(10)&\"Compétences : \"&Lundi!$G193))","v":""},{"$f":"IF(AND(Mardi!$D193=\"\",Mardi!$G193=\"\"),\"\",IF(Mardi!$D193=\"Récréation\",CONCATENATE(Mardi!$A193&\" / \"&Mardi!$B193)&CHAR(10)&\"RECREATION\",CONCATENATE(Mardi!$A193&\" / \"&Mardi!$B193)&CHAR(10)&\"Matière : \"&Mardi!$D193&CHAR(10)&\"Compétences : \"&Mardi!$G193))","v":""},{"$f":"IF(AND(Mercredi!$D193=\"\",Mercredi!$G193=\"\"),\"\",IF(Mercredi!$D193=\"Récréation\",CONCATENATE(Mercredi!$A193&\" / \"&Mercredi!$B193)&CHAR(10)&\"RECREATION\",CONCATENATE(Mercredi!$A193&\" / \"&Mercredi!$B193)&CHAR(10)&\"Matière : \"&Mercredi!$D193&CHAR(10)&\"Compétences : \"&Mercredi!$G193))","v":""},{"$f":"IF(AND(Jeudi!$D193=\"\",Jeudi!$G193=\"\"),\"\",IF(Jeudi!$D193=\"Récréation\",CONCATENATE(Jeudi!$A193&\" / \"&Jeudi!$B193)&CHAR(10)&\"RECREATION\",CONCATENATE(Jeudi!$A193&\" / \"&Jeudi!$B193)&CHAR(10)&\"Matière : \"&Jeudi!$D193&CHAR(10)&\"Compétences : \"&Jeudi!$G193))","v":""},{"$f":"IF(AND(Vendredi!$D193=\"\",Vendredi!$G193=\"\"),\"\",IF(Vendredi!$D193=\"Récréation\",CONCATENATE(Vendredi!$A193&\" / \"&Vendredi!$B193)&CHAR(10)&\"RECREATION\",CONCATENATE(Vendredi!$A193&\" / \"&Vendredi!$B193)&CHAR(10)&\"Matière : \"&Vendredi!$D193&CHAR(10)&\"Compétences : \"&Vendredi!$G193))","v":""}]
[{"$f":"IF(AND(Lundi!$D194=\"\",Lundi!$G194=\"\"),\"\",IF(Lundi!$D194=\"Récréation\",CONCATENATE(Lundi!A194&\" / \"&Lundi!B194)&CHAR(10)&\"RECREATION\",CONCATENATE(Lundi!A194&\" / \"&Lundi!B194)&CHAR(10)&\"Matière : \"&Lundi!$D194&CHAR(10)&\"Compétences : \"&Lundi!$G194))","v":""},{"$f":"IF(AND(Mardi!$D194=\"\",Mardi!$G194=\"\"),\"\",IF(Mardi!$D194=\"Récréation\",CONCATENATE(Mardi!$A194&\" / \"&Mardi!$B194)&CHAR(10)&\"RECREATION\",CONCATENATE(Mardi!$A194&\" / \"&Mardi!$B194)&CHAR(10)&\"Matière : \"&Mardi!$D194&CHAR(10)&\"Compétences : \"&Mardi!$G194))","v":""},{"$f":"IF(AND(Mercredi!$D194=\"\",Mercredi!$G194=\"\"),\"\",IF(Mercredi!$D194=\"Récréation\",CONCATENATE(Mercredi!$A194&\" / \"&Mercredi!$B194)&CHAR(10)&\"RECREATION\",CONCATENATE(Mercredi!$A194&\" / \"&Mercredi!$B194)&CHAR(10)&\"Matière : \"&Mercredi!$D194&CHAR(10)&\"Compétences : \"&Mercredi!$G194))","v":""},{"$f":"IF(AND(Jeudi!$D194=\"\",Jeudi!$G194=\"\"),\"\",IF(Jeudi!$D194=\"Récréation\",CONCATENATE(Jeudi!$A194&\" / \"&Jeudi!$B194)&CHAR(10)&\"RECREATION\",CONCATENATE(Jeudi!$A194&\" / \"&Jeudi!$B194)&CHAR(10)&\"Matière : \"&Jeudi!$D194&CHAR(10)&\"Compétences : \"&Jeudi!$G194))","v":""},{"$f":"IF(AND(Vendredi!$D194=\"\",Vendredi!$G194=\"\"),\"\",IF(Vendredi!$D194=\"Récréation\",CONCATENATE(Vendredi!$A194&\" / \"&Vendredi!$B194)&CHAR(10)&\"RECREATION\",CONCATENATE(Vendredi!$A194&\" / \"&Vendredi!$B194)&CHAR(10)&\"Matière : \"&Vendredi!$D194&CHAR(10)&\"Compétences : \"&Vendredi!$G194))","v":""}]
[{"$f":"IF(AND(Lundi!$D195=\"\",Lundi!$G195=\"\"),\"\",IF(Lundi!$D195=\"Récréation\",CONCATENATE(Lundi!A195&\" / \"&Lundi!B195)&CHAR(10)&\"RECREATION\",CONCATENATE(Lundi!A195&\" / \"&Lundi!B195)&CHAR(10)&\"Matière : \"&Lundi!$D195&CHAR(10)&\"Compétences : \"&Lundi!$G195))","v":""},{"$f":"IF(AND(Mardi!$D195=\"\",Mardi!$G195=\"\"),\"\",IF(Mardi!$D195=\"Récréation\",CONCATENATE(Mardi!$A195&\" / \"&Mardi!$B195)&CHAR(10)&\"RECREATION\",CONCATENATE(Mardi!$A195&\" / \"&Mardi!$B195)&CHAR(10)&\"Matière : \"&Mardi!$D195&CHAR(10)&\"Compétences : \"&Mardi!$G195))","v":""},{"$f":"IF(AND(Mercredi!$D195=\"\",Mercredi!$G195=\"\"),\"\",IF(Mercredi!$D195=\"Récréation\",CONCATENATE(Mercredi!$A195&\" / \"&Mercredi!$B195)&CHAR(10)&\"RECREATION\",CONCATENATE(Mercredi!$A195&\" / \"&Mercredi!$B195)&CHAR(10)&\"Matière : \"&Mercredi!$D195&CHAR(10)&\"Compétences : \"&Mercredi!$G195))","v":""},{"$f":"IF(AND(Jeudi!$D195=\"\",Jeudi!$G195=\"\"),\"\",IF(Jeudi!$D195=\"Récréation\",CONCATENATE(Jeudi!$A195&\" / \"&Jeudi!$B195)&CHAR(10)&\"RECREATION\",CONCATENATE(Jeudi!$A195&\" / \"&Jeudi!$B195)&CHAR(10)&\"Matière : \"&Jeudi!$D195&CHAR(10)&\"Compétences : \"&Jeudi!$G195))","v":""},{"$f":"IF(AND(Vendredi!$D195=\"\",Vendredi!$G195=\"\"),\"\",IF(Vendredi!$D195=\"Récréation\",CONCATENATE(Vendredi!$A195&\" / \"&Vendredi!$B195)&CHAR(10)&\"RECREATION\",CONCATENATE(Vendredi!$A195&\" / \"&Vendredi!$B195)&CHAR(10)&\"Matière : \"&Vendredi!$D195&CHAR(10)&\"Compétences : \"&Vendredi!$G195))","v":""}]
[{"$f":"IF(AND(Lundi!$D196=\"\",Lundi!$G196=\"\"),\"\",IF(Lundi!$D196=\"Récréation\",CONCATENATE(Lundi!A196&\" / \"&Lundi!B196)&CHAR(10)&\"RECREATION\",CONCATENATE(Lundi!A196&\" / \"&Lundi!B196)&CHAR(10)&\"Matière : \"&Lundi!$D196&CHAR(10)&\"Compétences : \"&Lundi!$G196))","v":""},{"$f":"IF(AND(Mardi!$D196=\"\",Mardi!$G196=\"\"),\"\",IF(Mardi!$D196=\"Récréation\",CONCATENATE(Mardi!$A196&\" / \"&Mardi!$B196)&CHAR(10)&\"RECREATION\",CONCATENATE(Mardi!$A196&\" / \"&Mardi!$B196)&CHAR(10)&\"Matière : \"&Mardi!$D196&CHAR(10)&\"Compétences : \"&Mardi!$G196))","v":""},{"$f":"IF(AND(Mercredi!$D196=\"\",Mercredi!$G196=\"\"),\"\",IF(Mercredi!$D196=\"Récréation\",CONCATENATE(Mercredi!$A196&\" / \"&Mercredi!$B196)&CHAR(10)&\"RECREATION\",CONCATENATE(Mercredi!$A196&\" / \"&Mercredi!$B196)&CHAR(10)&\"Matière : \"&Mercredi!$D196&CHAR(10)&\"Compétences : \"&Mercredi!$G196))","v":""},{"$f":"IF(AND(Jeudi!$D196=\"\",Jeudi!$G196=\"\"),\"\",IF(Jeudi!$D196=\"Récréation\",CONCATENATE(Jeudi!$A196&\" / \"&Jeudi!$B196)&CHAR(10)&\"RECREATION\",CONCATENATE(Jeudi!$A196&\" / \"&Jeudi!$B196)&CHAR(10)&\"Matière : \"&Jeudi!$D196&CHAR(10)&\"Compétences : \"&Jeudi!$G196))","v":""},{"$f":"IF(AND(Vendredi!$D196=\"\",Vendredi!$G196=\"\"),\"\",IF(Vendredi!$D196=\"Récréation\",CONCATENATE(Vendredi!$A196&\" / \"&Vendredi!$B196)&CHAR(10)&\"RECREATION\",CONCATENATE(Vendredi!$A196&\" / \"&Vendredi!$B196)&CHAR(10)&\"Matière : \"&Vendredi!$D196&CHAR(10)&\"Compétences : \"&Vendredi!$G196))","v":""}]
[{"$f":"IF(AND(Lundi!$D197=\"\",Lundi!$G197=\"\"),\"\",IF(Lundi!$D197=\"Récréation\",CONCATENATE(Lundi!A197&\" / \"&Lundi!B197)&CHAR(10)&\"RECREATION\",CONCATENATE(Lundi!A197&\" / \"&Lundi!B197)&CHAR(10)&\"Matière : \"&Lundi!$D197&CHAR(10)&\"Compétences : \"&Lundi!$G197))","v":""},{"$f":"IF(AND(Mardi!$D197=\"\",Mardi!$G197=\"\"),\"\",IF(Mardi!$D197=\"Récréation\",CONCATENATE(Mardi!$A197&\" / \"&Mardi!$B197)&CHAR(10)&\"RECREATION\",CONCATENATE(Mardi!$A197&\" / \"&Mardi!$B197)&CHAR(10)&\"Matière : \"&Mardi!$D197&CHAR(10)&\"Compétences : \"&Mardi!$G197))","v":""},{"$f":"IF(AND(Mercredi!$D197=\"\",Mercredi!$G197=\"\"),\"\",IF(Mercredi!$D197=\"Récréation\",CONCATENATE(Mercredi!$A197&\" / \"&Mercredi!$B197)&CHAR(10)&\"RECREATION\",CONCATENATE(Mercredi!$A197&\" / \"&Mercredi!$B197)&CHAR(10)&\"Matière : \"&Mercredi!$D197&CHAR(10)&\"Compétences : \"&Mercredi!$G197))","v":""},{"$f":"IF(AND(Jeudi!$D197=\"\",Jeudi!$G197=\"\"),\"\",IF(Jeudi!$D197=\"Récréation\",CONCATENATE(Jeudi!$A197&\" / \"&Jeudi!$B197)&CHAR(10)&\"RECREATION\",CONCATENATE(Jeudi!$A197&\" / \"&Jeudi!$B197)&CHAR(10)&\"Matière : \"&Jeudi!$D197&CHAR(10)&\"Compétences : \"&Jeudi!$G197))","v":""},{"$f":"IF(AND(Vendredi!$D197=\"\",Vendredi!$G197=\"\"),\"\",IF(Vendredi!$D197=\"Récréation\",CONCATENATE(Vendredi!$A197&\" / \"&Vendredi!$B197)&CHAR(10)&\"RECREATION\",CONCATENATE(Vendredi!$A197&\" / \"&Vendredi!$B197)&CHAR(10)&\"Matière : \"&Vendredi!$D197&CHAR(10)&\"Compétences : \"&Vendredi!$G197))","v":""}]
[{"$f":"IF(AND(Lundi!$D198=\"\",Lundi!$G198=\"\"),\"\",IF(Lundi!$D198=\"Récréation\",CONCATENATE(Lundi!A198&\" / \"&Lundi!B198)&CHAR(10)&\"RECREATION\",CONCATENATE(Lundi!A198&\" / \"&Lundi!B198)&CHAR(10)&\"Matière : \"&Lundi!$D198&CHAR(10)&\"Compétences : \"&Lundi!$G198))","v":""},{"$f":"IF(AND(Mardi!$D198=\"\",Mardi!$G198=\"\"),\"\",IF(Mardi!$D198=\"Récréation\",CONCATENATE(Mardi!$A198&\" / \"&Mardi!$B198)&CHAR(10)&\"RECREATION\",CONCATENATE(Mardi!$A198&\" / \"&Mardi!$B198)&CHAR(10)&\"Matière : \"&Mardi!$D198&CHAR(10)&\"Compétences : \"&Mardi!$G198))","v":""},{"$f":"IF(AND(Mercredi!$D198=\"\",Mercredi!$G198=\"\"),\"\",IF(Mercredi!$D198=\"Récréation\",CONCATENATE(Mercredi!$A198&\" / \"&Mercredi!$B198)&CHAR(10)&\"RECREATION\",CONCATENATE(Mercredi!$A198&\" / \"&Mercredi!$B198)&CHAR(10)&\"Matière : \"&Mercredi!$D198&CHAR(10)&\"Compétences : \"&Mercredi!$G198))","v":""},{"$f":"IF(AND(Jeudi!$D198=\"\",Jeudi!$G198=\"\"),\"\",IF(Jeudi!$D198=\"Récréation\",CONCATENATE(Jeudi!$A198&\" / \"&Jeudi!$B198)&CHAR(10)&\"RECREATION\",CONCATENATE(Jeudi!$A198&\" / \"&Jeudi!$B198)&CHAR(10)&\"Matière : \"&Jeudi!$D198&CHAR(10)&\"Compétences : \"&Jeudi!$G198))","v":""},{"$f":"IF(AND(Vendredi!$D198=\"\",Vendredi!$G198=\"\"),\"\",IF(Vendredi!$D198=\"Récréation\",CONCATENATE(Vendredi!$A198&\" / \"&Vendredi!$B198)&CHAR(10)&\"RECREATION\",CONCATENATE(Vendredi!$A198&\" / \"&Vendredi!$B198)&CHAR(10)&\"Matière : \"&Vendredi!$D198&CHAR(10)&\"Compétences : \"&Vendredi!$G198))","v":""}]
[{"$f":"IF(AND(Lundi!$D199=\"\",Lundi!$G199=\"\"),\"\",IF(Lundi!$D199=\"Récréation\",CONCATENATE(Lundi!A199&\" / \"&Lundi!B199)&CHAR(10)&\"RECREATION\",CONCATENATE(Lundi!A199&\" / \"&Lundi!B199)&CHAR(10)&\"Matière : \"&Lundi!$D199&CHAR(10)&\"Compétences : \"&Lundi!$G199))","v":""},{"$f":"IF(AND(Mardi!$D199=\"\",Mardi!$G199=\"\"),\"\",IF(Mardi!$D199=\"Récréation\",CONCATENATE(Mardi!$A199&\" / \"&Mardi!$B199)&CHAR(10)&\"RECREATION\",CONCATENATE(Mardi!$A199&\" / \"&Mardi!$B199)&CHAR(10)&\"Matière : \"&Mardi!$D199&CHAR(10)&\"Compétences : \"&Mardi!$G199))","v":""},{"$f":"IF(AND(Mercredi!$D199=\"\",Mercredi!$G199=\"\"),\"\",IF(Mercredi!$D199=\"Récréation\",CONCATENATE(Mercredi!$A199&\" / \"&Mercredi!$B199)&CHAR(10)&\"RECREATION\",CONCATENATE(Mercredi!$A199&\" / \"&Mercredi!$B199)&CHAR(10)&\"Matière : \"&Mercredi!$D199&CHAR(10)&\"Compétences : \"&Mercredi!$G199))","v":""},{"$f":"IF(AND(Jeudi!$D199=\"\",Jeudi!$G199=\"\"),\"\",IF(Jeudi!$D199=\"Récréation\",CONCATENATE(Jeudi!$A199&\" / \"&Jeudi!$B199)&CHAR(10)&\"RECREATION\",CONCATENATE(Jeudi!$A199&\" / \"&Jeudi!$B199)&CHAR(10)&\"Matière : \"&Jeudi!$D199&CHAR(10)&\"Compétences : \"&Jeudi!$G199))","v":""},{"$f":"IF(AND(Vendredi!$D199=\"\",Vendredi!$G199=\"\"),\"\",IF(Vendredi!$D199=\"Récréation\",CONCATENATE(Vendredi!$A199&\" / \"&Vendredi!$B199)&CHAR(10)&\"RECREATION\",CONCATENATE(Vendredi!$A199&\" / \"&Vendredi!$B199)&CHAR(10)&\"Matière : \"&Vendredi!$D199&CHAR(10)&\"Compétences : \"&Vendredi!$G199))","v":""}]
[{"$f":"IF(AND(Lundi!$D200=\"\",Lundi!$G200=\"\"),\"\",IF(Lundi!$D200=\"Récréation\",CONCATENATE(Lundi!A200&\" / \"&Lundi!B200)&CHAR(10)&\"RECREATION\",CONCATENATE(Lundi!A200&\" / \"&Lundi!B200)&CHAR(10)&\"Matière : \"&Lundi!$D200&CHAR(10)&\"Compétences : \"&Lundi!$G200))","v":""},{"$f":"IF(AND(Mardi!$D200=\"\",Mardi!$G200=\"\"),\"\",IF(Mardi!$D200=\"Récréation\",CONCATENATE(Mardi!$A200&\" / \"&Mardi!$B200)&CHAR(10)&\"RECREATION\",CONCATENATE(Mardi!$A200&\" / \"&Mardi!$B200)&CHAR(10)&\"Matière : \"&Mardi!$D200&CHAR(10)&\"Compétences : \"&Mardi!$G200))","v":""},{"$f":"IF(AND(Mercredi!$D200=\"\",Mercredi!$G200=\"\"),\"\",IF(Mercredi!$D200=\"Récréation\",CONCATENATE(Mercredi!$A200&\" / \"&Mercredi!$B200)&CHAR(10)&\"RECREATION\",CONCATENATE(Mercredi!$A200&\" / \"&Mercredi!$B200)&CHAR(10)&\"Matière : \"&Mercredi!$D200&CHAR(10)&\"Compétences : \"&Mercredi!$G200))","v":""},{"$f":"IF(AND(Jeudi!$D200=\"\",Jeudi!$G200=\"\"),\"\",IF(Jeudi!$D200=\"Récréation\",CONCATENATE(Jeudi!$A200&\" / \"&Jeudi!$B200)&CHAR(10)&\"RECREATION\",CONCATENATE(Jeudi!$A200&\" / \"&Jeudi!$B200)&CHAR(10)&\"Matière : \"&Jeudi!$D200&CHAR(10)&\"Compétences : \"&Jeudi!$G200))","v":""},{"$f":"IF(AND(Vendredi!$D200=\"\",Vendredi!$G200=\"\"),\"\",IF(Vendredi!$D200=\"Récréation\",CONCATENATE(Vendredi!$A200&\" / \"&Vendredi!$B200)&CHAR(10)&\"RECREATION\",CONCATENATE(Vendredi!$A200&\" / \"&Vendredi!$B200)&CHAR(10)&\"Matière : \"&Vendredi!$D200&CHAR(10)&\"Compétences : \"&Vendredi!$G200))","v":""}]
[{"$f":"IF(AND(Lundi!$D201=\"\",Lundi!$G201=\"\"),\"\",IF(Lundi!$D201=\"Récréation\",CONCATENATE(Lundi!A201&\" / \"&Lundi!B201)&CHAR(10)&\"RECREATION\",CONCATENATE(Lundi!A201&\" / \"&Lundi!B201)&CHAR(10)&\"Matière : \"&Lundi!$D201&CHAR(10)&\"Compétences : \"&Lundi!$G201))","v":""},{"$f":"IF(AND(Mardi!$D201=\"\",Mardi!$G201=\"\"),\"\",IF(Mardi!$D201=\"Récréation\",CONCATENATE(Mardi!$A201&\" / \"&Mardi!$B201)&CHAR(10)&\"RECREATION\",CONCATENATE(Mardi!$A201&\" / \"&Mardi!$B201)&CHAR(10)&\"Matière : \"&Mardi!$D201&CHAR(10)&\"Compétences : \"&Mardi!$G201))","v":""},{"$f":"IF(AND(Mercredi!$D201=\"\",Mercredi!$G201=\"\"),\"\",IF(Mercredi!$D201=\"Récréation\",CONCATENATE(Mercredi!$A201&\" / \"&Mercredi!$B201)&CHAR(10)&\"RECREATION\",CONCATENATE(Mercredi!$A201&\" / \"&Mercredi!$B201)&CHAR(10)&\"Matière : \"&Mercredi!$D201&CHAR(10)&\"Compétences : \"&Mercredi!$G201))","v":""},{"$f":"IF(AND(Jeudi!$D201=\"\",Jeudi!$G201=\"\"),\"\",IF(Jeudi!$D201=\"Récréation\",CONCATENATE(Jeudi!$A201&\" / \"&Jeudi!$B201)&CHAR(10)&\"RECREATION\",CONCATENATE(Jeudi!$A201&\" / \"&Jeudi!$B201)&CHAR(10)&\"Matière : \"&Jeudi!$D201&CHAR(10)&\"Compétences : \"&Jeudi!$G201))","v":""},{"$f":"IF(AND(Vendredi!$D201=\"\",Vendredi!$G201=\"\"),\"\",IF(Vendredi!$D201=\"Récréation\",CONCATENATE(Vendredi!$A201&\" / \"&Vendredi!$B201)&CHAR(10)&\"RECREATION\",CONCATENATE(Vendredi!$A201&\" / \"&Vendredi!$B201)&CHAR(10)&\"Matière : \"&Vendredi!$D201&CHAR(10)&\"Compétences : \"&Vendredi!$G201))","v":""}]
[{"$f":"IF(AND(Lundi!$D202=\"\",Lundi!$G202=\"\"),\"\",IF(Lundi!$D202=\"Récréation\",CONCATENATE(Lundi!A202&\" / \"&Lundi!B202)&CHAR(10)&\"RECREATION\",CONCATENATE(Lundi!A202&\" / \"&Lundi!B202)&CHAR(10)&\"Matière : \"&Lundi!$D202&CHAR(10)&\"Compétences : \"&Lundi!$G202))","v":""},{"$f":"IF(AND(Mardi!$D202=\"\",Mardi!$G202=\"\"),\"\",IF(Mardi!$D202=\"Récréation\",CONCATENATE(Mardi!$A202&\" / \"&Mardi!$B202)&CHAR(10)&\"RECREATION\",CONCATENATE(Mardi!$A202&\" / \"&Mardi!$B202)&CHAR(10)&\"Matière : \"&Mardi!$D202&CHAR(10)&\"Compétences : \"&Mardi!$G202))","v":""},{"$f":"IF(AND(Mercredi!$D202=\"\",Mercredi!$G202=\"\"),\"\",IF(Mercredi!$D202=\"Récréation\",CONCATENATE(Mercredi!$A202&\" / \"&Mercredi!$B202)&CHAR(10)&\"RECREATION\",CONCATENATE(Mercredi!$A202&\" / \"&Mercredi!$B202)&CHAR(10)&\"Matière : \"&Mercredi!$D202&CHAR(10)&\"Compétences : \"&Mercredi!$G202))","v":""},{"$f":"IF(AND(Jeudi!$D202=\"\",Jeudi!$G202=\"\"),\"\",IF(Jeudi!$D202=\"Récréation\",CONCATENATE(Jeudi!$A202&\" / \"&Jeudi!$B202)&CHAR(10)&\"RECREATION\",CONCATENATE(Jeudi!$A202&\" / \"&Jeudi!$B202)&CHAR(10)&\"Matière : \"&Jeudi!$D202&CHAR(10)&\"Compétences : \"&Jeudi!$G202))","v":""},{"$f":"IF(AND(Vendredi!$D202=\"\",Vendredi!$G202=\"\"),\"\",IF(Vendredi!$D202=\"Récréation\",CONCATENATE(Vendredi!$A202&\" / \"&Vendredi!$B202)&CHAR(10)&\"RECREATION\",CONCATENATE(Vendredi!$A202&\" / \"&Vendredi!$B202)&CHAR(10)&\"Matière : \"&Vendredi!$D202&CHAR(10)&\"Compétences : \"&Vendredi!$G202))","v":""}]
[{"$f":"IF(AND(Lundi!$D203=\"\",Lundi!$G203=\"\"),\"\",IF(Lundi!$D203=\"Récréation\",CONCATENATE(Lundi!A203&\" / \"&Lundi!B203)&CHAR(10)&\"RECREATION\",CONCATENATE(Lundi!A203&\" / \"&Lundi!B203)&CHAR(10)&\"Matière : \"&Lundi!$D203&CHAR(10)&\"Compétences : \"&Lundi!$G203))","v":""},{"$f":"IF(AND(Mardi!$D203=\"\",Mardi!$G203=\"\"),\"\",IF(Mardi!$D203=\"Récréation\",CONCATENATE(Mardi!$A203&\" / \"&Mardi!$B203)&CHAR(10)&\"RECREATION\",CONCATENATE(Mardi!$A203&\" / \"&Mardi!$B203)&CHAR(10)&\"Matière : \"&Mardi!$D203&CHAR(10)&\"Compétences : \"&Mardi!$G203))","v":""},{"$f":"IF(AND(Mercredi!$D203=\"\",Mercredi!$G203=\"\"),\"\",IF(Mercredi!$D203=\"Récréation\",CONCATENATE(Mercredi!$A203&\" / \"&Mercredi!$B203)&CHAR(10)&\"RECREATION\",CONCATENATE(Mercredi!$A203&\" / \"&Mercredi!$B203)&CHAR(10)&\"Matière : \"&Mercredi!$D203&CHAR(10)&\"Compétences : \"&Mercredi!$G203))","v":""},{"$f":"IF(AND(Jeudi!$D203=\"\",Jeudi!$G203=\"\"),\"\",IF(Jeudi!$D203=\"Récréation\",CONCATENATE(Jeudi!$A203&\" / \"&Jeudi!$B203)&CHAR(10)&\"RECREATION\",CONCATENATE(Jeudi!$A203&\" / \"&Jeudi!$B203)&CHAR(10)&\"Matière : \"&Jeudi!$D203&CHAR(10)&\"Compétences : \"&Jeudi!$G203))","v":""},{"$f":"IF(AND(Vendredi!$D203=\"\",Vendredi!$G203=\"\"),\"\",IF(Vendredi!$D203=\"Récréation\",CONCATENATE(Vendredi!$A203&\" / \"&Vendredi!$B203)&CHAR(10)&\"RECREATION\",CONCATENATE(Vendredi!$A203&\" / \"&Vendredi!$B203)&CHAR(10)&\"Matière : \"&Vendredi!$D203&CHAR(10)&\"Compétences : \"&Vendredi!$G203))","v":""}]
[{"$f":"IF(AND(Lundi!$D204=\"\",Lundi!$G204=\"\"),\"\",IF(Lundi!$D204=\"Récréation\",CONCATENATE(Lundi!A204&\" / \"&Lundi!B204)&CHAR(10)&\"RECREATION\",CONCATENATE(Lundi!A204&\" / \"&Lundi!B204)&CHAR(10)&\"Matière : \"&Lundi!$D204&CHAR(10)&\"Compétences : \"&Lundi!$G204))","v":""},{"$f":"IF(AND(Mardi!$D204=\"\",Mardi!$G204=\"\"),\"\",IF(Mardi!$D204=\"Récréation\",CONCATENATE(Mardi!$A204&\" / \"&Mardi!$B204)&CHAR(10)&\"RECREATION\",CONCATENATE(Mardi!$A204&\" / \"&Mardi!$B204)&CHAR(10)&\"Matière : \"&Mardi!$D204&CHAR(10)&\"Compétences : \"&Mardi!$G204))","v":""},{"$f":"IF(AND(Mercredi!$D204=\"\",Mercredi!$G204=\"\"),\"\",IF(Mercredi!$D204=\"Récréation\",CONCATENATE(Mercredi!$A204&\" / \"&Mercredi!$B204)&CHAR(10)&\"RECREATION\",CONCATENATE(Mercredi!$A204&\" / \"&Mercredi!$B204)&CHAR(10)&\"Matière : \"&Mercredi!$D204&CHAR(10)&\"Compétences : \"&Mercredi!$G204))","v":""},{"$f":"IF(AND(Jeudi!$D204=\"\",Jeudi!$G204=\"\"),\"\",IF(Jeudi!$D204=\"Récréation\",CONCATENATE(Jeudi!$A204&\" / \"&Jeudi!$B204)&CHAR(10)&\"RECREATION\",CONCATENATE(Jeudi!$A204&\" / \"&Jeudi!$B204)&CHAR(10)&\"Matière : \"&Jeudi!$D204&CHAR(10)&\"Compétences : \"&Jeudi!$G204))","v":""},{"$f":"IF(AND(Vendredi!$D204=\"\",Vendredi!$G204=\"\"),\"\",IF(Vendredi!$D204=\"Récréation\",CONCATENATE(Vendredi!$A204&\" / \"&Vendredi!$B204)&CHAR(10)&\"RECREATION\",CONCATENATE(Vendredi!$A204&\" / \"&Vendredi!$B204)&CHAR(10)&\"Matière : \"&Vendredi!$D204&CHAR(10)&\"Compétences : \"&Vendredi!$G204))","v":""}]
[{"$f":"IF(AND(Lundi!$D205=\"\",Lundi!$G205=\"\"),\"\",IF(Lundi!$D205=\"Récréation\",\"RECREATION\",\"Matière : \"&Lundi!$D205&\" \"&\"Compétences : \"&Lundi!$G205))","v":""}]
[{"$f":"IF(AND(Lundi!$D206=\"\",Lundi!$G206=\"\"),\"\",IF(Lundi!$D206=\"Récréation\",\"RECREATION\",\"Matière : \"&Lundi!$D206&\" \"&\"Compétences : \"&Lundi!$G206))","v":""}]
[{"$f":"IF(AND(Lundi!$D207=\"\",Lundi!$G207=\"\"),\"\",IF(Lundi!$D207=\"Récréation\",\"RECREATION\",\"Matière : \"&Lundi!$D207&\" \"&\"Compétences : \"&Lundi!$G207))","v":""}]
[{"$f":"IF(AND(Lundi!$D208=\"\",Lundi!$G208=\"\"),\"\",IF(Lundi!$D208=\"Récréation\",\"RECREATION\",\"Matière : \"&Lundi!$D208&\" \"&\"Compétences : \"&Lundi!$G208))","v":""}]
[{"$f":"IF(AND(Lundi!$D209=\"\",Lundi!$G209=\"\"),\"\",IF(Lundi!$D209=\"Récréation\",\"RECREATION\",\"Matière : \"&Lundi!$D209&\" \"&\"Compétences : \"&Lundi!$G209))","v":""}]
[{"$f":"IF(AND(Lundi!$D210=\"\",Lundi!$G210=\"\"),\"\",IF(Lundi!$D210=\"Récréation\",\"RECREATION\",\"Matière : \"&Lundi!$D210&\" \"&\"Compétences : \"&Lundi!$G210))","v":""}]
[{"$f":"IF(AND(Lundi!$D211=\"\",Lundi!$G211=\"\"),\"\",IF(Lundi!$D211=\"Récréation\",\"RECREATION\",\"Matière : \"&Lundi!$D211&\" \"&\"Compétences : \"&Lundi!$G211))","v":""}]
[{"$f":"IF(AND(Lundi!$D212=\"\",Lundi!$G212=\"\"),\"\",IF(Lundi!$D212=\"Récréation\",\"RECREATION\",\"Matière : \"&Lundi!$D212&\" \"&\"Compétences : \"&Lundi!$G212))","v":""}]
[{"$f":"IF(AND(Lundi!$D213=\"\",Lundi!$G213=\"\"),\"\",IF(Lundi!$D213=\"Récréation\",\"RECREATION\",\"Matière : \"&Lundi!$D213&\" \"&\"Compétences : \"&Lundi!$G213))","v":""}]
[{"$f":"IF(AND(Lundi!$D214=\"\",Lundi!$G214=\"\"),\"\",IF(Lundi!$D214=\"Récréation\",\"RECREATION\",\"Matière : \"&Lundi!$D214&\" \"&\"Compétences : \"&Lundi!$G214))","v":""}]
[{"$f":"IF(AND(Lundi!$D215=\"\",Lundi!$G215=\"\"),\"\",IF(Lundi!$D215=\"Récréation\",\"RECREATION\",\"Matière : \"&Lundi!$D215&\" \"&\"Compétences : \"&Lundi!$G215))","v":""}]
[{"$f":"IF(AND(Lundi!$D216=\"\",Lundi!$G216=\"\"),\"\",IF(Lundi!$D216=\"Récréation\",\"RECREATION\",\"Matière : \"&Lundi!$D216&\" \"&\"Compétences : \"&Lundi!$G216))","v":""}]
[{"$f":"IF(AND(Lundi!$D217=\"\",Lundi!$G217=\"\"),\"\",IF(Lundi!$D217=\"Récréation\",\"RECREATION\",\"Matière : \"&Lundi!$D217&\" \"&\"Compétences : \"&Lundi!$G217))","v":""}]
[{"$f":"IF(AND(Lundi!$D218=\"\",Lundi!$G218=\"\"),\"\",IF(Lundi!$D218=\"Récréation\",\"RECREATION\",\"Matière : \"&Lundi!$D218&\" \"&\"Compétences : \"&Lundi!$G218))","v":""}]
[{"$f":"IF(AND(Lundi!$D219=\"\",Lundi!$G219=\"\"),\"\",IF(Lundi!$D219=\"Récréation\",\"RECREATION\",\"Matière : \"&Lundi!$D219&\" \"&\"Compétences : \"&Lundi!$G219))","v":""}]
[{"$f":"IF(AND(Lundi!$D220=\"\",Lundi!$G220=\"\"),\"\",IF(Lundi!$D220=\"Récréation\",\"RECREATION\",\"Matière : \"&Lundi!$D220&\" \"&\"Compétences : \"&Lundi!$G220))","v":""}]
[{"$f":"IF(AND(Lundi!$D221=\"\",Lundi!$G221=\"\"),\"\",IF(Lundi!$D221=\"Récréation\",\"RECREATION\",\"Matière : \"&Lundi!$D221&\" \"&\"Compétences : \"&Lundi!$G221))","v":""}]
[{"$f":"IF(AND(Lundi!$D222=\"\",Lundi!$G222=\"\"),\"\",IF(Lundi!$D222=\"Récréation\",\"RECREATION\",\"Matière : \"&Lundi!$D222&\" \"&\"Compétences : \"&Lundi!$G222))","v":""}]
[{"$f":"IF(AND(Lundi!$D223=\"\",Lundi!$G223=\"\"),\"\",IF(Lundi!$D223=\"Récréation\",\"RECREATION\",\"Matière : \"&Lundi!$D223&\" \"&\"Compétences : \"&Lundi!$G223))","v":""}]
[{"$f":"IF(AND(Lundi!$D224=\"\",Lundi!$G224=\"\"),\"\",IF(Lundi!$D224=\"Récréation\",\"RECREATION\",\"Matière : \"&Lundi!$D224&\" \"&\"Compétences : \"&Lundi!$G224))","v":""}]
[{"$f":"IF(AND(Lundi!$D225=\"\",Lundi!$G225=\"\"),\"\",IF(Lundi!$D225=\"Récréation\",\"RECREATION\",\"Matière : \"&Lundi!$D225&\" \"&\"Compétences : \"&Lundi!$G225))","v":""}]
[{"$f":"IF(AND(Lundi!$D226=\"\",Lundi!$G226=\"\"),\"\",IF(Lundi!$D226=\"Récréation\",\"RECREATION\",\"Matière : \"&Lundi!$D226&\" \"&\"Compétences : \"&Lundi!$G226))","v":""}]
[{"$f":"IF(AND(Lundi!$D227=\"\",Lundi!$G227=\"\"),\"\",IF(Lundi!$D227=\"Récréation\",\"RECREATION\",\"Matière : \"&Lundi!$D227&\" \"&\"Compétences : \"&Lundi!$G227))","v":""}]
[{"$f":"IF(AND(Lundi!$D228=\"\",Lundi!$G228=\"\"),\"\",IF(Lundi!$D228=\"Récréation\",\"RECREATION\",\"Matière : \"&Lundi!$D228&\" \"&\"Compétences : \"&Lundi!$G228))","v":""}]
[{"$f":"IF(AND(Lundi!$D229=\"\",Lundi!$G229=\"\"),\"\",IF(Lundi!$D229=\"Récréation\",\"RECREATION\",\"Matière : \"&Lundi!$D229&\" \"&\"Compétences : \"&Lundi!$G229))","v":""}]
[{"$f":"IF(AND(Lundi!$D230=\"\",Lundi!$G230=\"\"),\"\",IF(Lundi!$D230=\"Récréation\",\"RECREATION\",\"Matière : \"&Lundi!$D230&\" \"&\"Compétences : \"&Lundi!$G230))","v":""}]
[{"$f":"IF(AND(Lundi!$D231=\"\",Lundi!$G231=\"\"),\"\",IF(Lundi!$D231=\"Récréation\",\"RECREATION\",\"Matière : \"&Lundi!$D231&\" \"&\"Compétences : \"&Lundi!$G231))","v":""}]
[{"$f":"IF(AND(Lundi!$D232=\"\",Lundi!$G232=\"\"),\"\",IF(Lundi!$D232=\"Récréation\",\"RECREATION\",\"Matière : \"&Lundi!$D232&\" \"&\"Compétences : \"&Lundi!$G232))","v":""}]
[{"$f":"IF(AND(Lundi!$D233=\"\",Lundi!$G233=\"\"),\"\",IF(Lundi!$D233=\"Récréation\",\"RECREATION\",\"Matière : \"&Lundi!$D233&\" \"&\"Compétences : \"&Lundi!$G233))","v":""}]
[{"$f":"IF(AND(Lundi!$D234=\"\",Lundi!$G234=\"\"),\"\",IF(Lundi!$D234=\"Récréation\",\"RECREATION\",\"Matière : \"&Lundi!$D234&\" \"&\"Compétences : \"&Lundi!$G234))","v":""}]
[{"$f":"IF(AND(Lundi!$D235=\"\",Lundi!$G235=\"\"),\"\",IF(Lundi!$D235=\"Récréation\",\"RECREATION\",\"Matière : \"&Lundi!$D235&\" \"&\"Compétences : \"&Lundi!$G235))","v":""}]
[{"$f":"IF(AND(Lundi!$D236=\"\",Lundi!$G236=\"\"),\"\",IF(Lundi!$D236=\"Récréation\",\"RECREATION\",\"Matière : \"&Lundi!$D236&\" \"&\"Compétences : \"&Lundi!$G236))","v":""}]
[{"$f":"IF(AND(Lundi!$D237=\"\",Lundi!$G237=\"\"),\"\",IF(Lundi!$D237=\"Récréation\",\"RECREATION\",\"Matière : \"&Lundi!$D237&\" \"&\"Compétences : \"&Lundi!$G237))","v":""}]
[{"$f":"IF(AND(Lundi!$D238=\"\",Lundi!$G238=\"\"),\"\",IF(Lundi!$D238=\"Récréation\",\"RECREATION\",\"Matière : \"&Lundi!$D238&\" \"&\"Compétences : \"&Lundi!$G238))","v":""}]
[{"$f":"IF(AND(Lundi!$D239=\"\",Lundi!$G239=\"\"),\"\",IF(Lundi!$D239=\"Récréation\",\"RECREATION\",\"Matière : \"&Lundi!$D239&\" \"&\"Compétences : \"&Lundi!$G239))","v":""}]
[{"$f":"IF(AND(Lundi!$D240=\"\",Lundi!$G240=\"\"),\"\",IF(Lundi!$D240=\"Récréation\",\"RECREATION\",\"Matière : \"&Lundi!$D240&\" \"&\"Compétences : \"&Lundi!$G240))","v":""}]
[{"$f":"IF(AND(Lundi!$D241=\"\",Lundi!$G241=\"\"),\"\",IF(Lundi!$D241=\"Récréation\",\"RECREATION\",\"Matière : \"&Lundi!$D241&\" \"&\"Compétences : \"&Lundi!$G241))","v":""}]
[{"$f":"IF(AND(Lundi!$D242=\"\",Lundi!$G242=\"\"),\"\",IF(Lundi!$D242=\"Récréation\",\"RECREATION\",\"Matière : \"&Lundi!$D242&\" \"&\"Compétences : \"&Lundi!$G242))","v":""}]
[{"$f":"IF(AND(Lundi!$D243=\"\",Lundi!$G243=\"\"),\"\",IF(Lundi!$D243=\"Récréation\",\"RECREATION\",\"Matière : \"&Lundi!$D243&\" \"&\"Compétences : \"&Lundi!$G243))","v":""}]
[{"$f":"IF(AND(Lundi!$D244=\"\",Lundi!$G244=\"\"),\"\",IF(Lundi!$D244=\"Récréation\",\"RECREATION\",\"Matière : \"&Lundi!$D244&\" \"&\"Compétences : \"&Lundi!$G244))","v":""}]
[{"$f":"IF(AND(Lundi!$D245=\"\",Lundi!$G245=\"\"),\"\",IF(Lundi!$D245=\"Récréation\",\"RECREATION\",\"Matière : \"&Lundi!$D245&\" \"&\"Compétences : \"&Lundi!$G245))","v":""}]
[{"$f":"IF(AND(Lundi!$D246=\"\",Lundi!$G246=\"\"),\"\",IF(Lundi!$D246=\"Récréation\",\"RECREATION\",\"Matière : \"&Lundi!$D246&\" \"&\"Compétences : \"&Lundi!$G246))","v":""}]
[{"$f":"IF(AND(Lundi!$D247=\"\",Lundi!$G247=\"\"),\"\",IF(Lundi!$D247=\"Récréation\",\"RECREATION\",\"Matière : \"&Lundi!$D247&\" \"&\"Compétences : \"&Lundi!$G247))","v":""}]
[{"$f":"IF(AND(Lundi!$D248=\"\",Lundi!$G248=\"\"),\"\",IF(Lundi!$D248=\"Récréation\",\"RECREATION\",\"Matière : \"&Lundi!$D248&\" \"&\"Compétences : \"&Lundi!$G248))","v":""}]
[{"$f":"IF(AND(Lundi!$D249=\"\",Lundi!$G249=\"\"),\"\",IF(Lundi!$D249=\"Récréation\",\"RECREATION\",\"Matière : \"&Lundi!$D249&\" \"&\"Compétences : \"&Lundi!$G249))","v":""}]
[{"$f":"IF(AND(Lundi!$D250=\"\",Lundi!$G250=\"\"),\"\",IF(Lundi!$D250=\"Récréation\",\"RECREATION\",\"Matière : \"&Lundi!$D250&\" \"&\"Compétences : \"&Lundi!$G250))","v":""}]
[{"$f":"IF(AND(Lundi!$D251=\"\",Lundi!$G251=\"\"),\"\",IF(Lundi!$D251=\"Récréation\",\"RECREATION\",\"Matière : \"&Lundi!$D251&\" \"&\"Compétences : \"&Lundi!$G251))","v":""}]
[{"$f":"IF(AND(Lundi!$D252=\"\",Lundi!$G252=\"\"),\"\",IF(Lundi!$D252=\"Récréation\",\"RECREATION\",\"Matière : \"&Lundi!$D252&\" \"&\"Compétences : \"&Lundi!$G252))","v":""}]
[{"$f":"IF(AND(Lundi!$D253=\"\",Lundi!$G253=\"\"),\"\",IF(Lundi!$D253=\"Récréation\",\"RECREATION\",\"Matière : \"&Lundi!$D253&\" \"&\"Compétences : \"&Lundi!$G253))","v":""}]
[{"$f":"IF(AND(Lundi!$D254=\"\",Lundi!$G254=\"\"),\"\",IF(Lundi!$D254=\"Récréation\",\"RECREATION\",\"Matière : \"&Lundi!$D254&\" \"&\"Compétences : \"&Lundi!$G254))","v":""}]
[{"$f":"IF(AND(Lundi!$D255=\"\",Lundi!$G255=\"\"),\"\",IF(Lundi!$D255=\"Récréation\",\"RECREATION\",\"Matière : \"&Lundi!$D255&\" \"&\"Compétences : \"&Lundi!$G255))","v":""}]
[{"$f":"IF(AND(Lundi!$D256=\"\",Lundi!$G256=\"\"),\"\",IF(Lundi!$D256=\"Récréation\",\"RECREATION\",\"Matière : \"&Lundi!$D256&\" \"&\"Compétences : \"&Lundi!$G256))","v":""}]
[{"$f":"IF(AND(Lundi!$D257=\"\",Lundi!$G257=\"\"),\"\",IF(Lundi!$D257=\"Récréation\",\"RECREATION\",\"Matière : \"&Lundi!$D257&\" \"&\"Compétences : \"&Lundi!$G257))","v":""}]
[{"$f":"IF(AND(Lundi!$D258=\"\",Lundi!$G258=\"\"),\"\",IF(Lundi!$D258=\"Récréation\",\"RECREATION\",\"Matière : \"&Lundi!$D258&\" \"&\"Compétences : \"&Lundi!$G258))","v":""}]
[{"$f":"IF(AND(Lundi!$D259=\"\",Lundi!$G259=\"\"),\"\",IF(Lundi!$D259=\"Récréation\",\"RECREATION\",\"Matière : \"&Lundi!$D259&\" \"&\"Compétences : \"&Lundi!$G259))","v":""}]
[{"$f":"IF(AND(Lundi!$D260=\"\",Lundi!$G260=\"\"),\"\",IF(Lundi!$D260=\"Récréation\",\"RECREATION\",\"Matière : \"&Lundi!$D260&\" \"&\"Compétences : \"&Lundi!$G260))","v":""}]
[{"$f":"IF(AND(Lundi!$D261=\"\",Lundi!$G261=\"\"),\"\",IF(Lundi!$D261=\"Récréation\",\"RECREATION\",\"Matière : \"&Lundi!$D261&\" \"&\"Compétences : \"&Lundi!$G261))","v":""}]
[{"$f":"IF(AND(Lundi!$D262=\"\",Lundi!$G262=\"\"),\"\",IF(Lundi!$D262=\"Récréation\",\"RECREATION\",\"Matière : \"&Lundi!$D262&\" \"&\"Compétences : \"&Lundi!$G262))","v":""}]
[{"$f":"IF(AND(Lundi!$D263=\"\",Lundi!$G263=\"\"),\"\",IF(Lundi!$D263=\"Récréation\",\"RECREATION\",\"Matière : \"&Lundi!$D263&\" \"&\"Compétences : \"&Lundi!$G263))","v":""}]
[{"$f":"IF(AND(Lundi!$D264=\"\",Lundi!$G264=\"\"),\"\",IF(Lundi!$D264=\"Récréation\",\"RECREATION\",\"Matière : \"&Lundi!$D264&\" \"&\"Compétences : \"&Lundi!$G264))","v":""}]
[{"$f":"IF(AND(Lundi!$D265=\"\",Lundi!$G265=\"\"),\"\",IF(Lundi!$D265=\"Récréation\",\"RECREATION\",\"Matière : \"&Lundi!$D265&\" \"&\"Compétences : \"&Lundi!$G265))","v":""}]
[{"$f":"IF(AND(Lundi!$D266=\"\",Lundi!$G266=\"\"),\"\",IF(Lundi!$D266=\"Récréation\",\"RECREATION\",\"Matière : \"&Lundi!$D266&\" \"&\"Compétences : \"&Lundi!$G266))","v":""}]
[{"$f":"IF(AND(Lundi!$D267=\"\",Lundi!$G267=\"\"),\"\",IF(Lundi!$D267=\"Récréation\",\"RECREATION\",\"Matière : \"&Lundi!$D267&\" \"&\"Compétences : \"&Lundi!$G267))","v":""}]
[{"$f":"IF(AND(Lundi!$D268=\"\",Lundi!$G268=\"\"),\"\",IF(Lundi!$D268=\"Récréation\",\"RECREATION\",\"Matière : \"&Lundi!$D268&\" \"&\"Compétences : \"&Lundi!$G268))","v":""}]
[{"$f":"IF(AND(Lundi!$D269=\"\",Lundi!$G269=\"\"),\"\",IF(Lundi!$D269=\"Récréation\",\"RECREATION\",\"Matière : \"&Lundi!$D269&\" \"&\"Compétences : \"&Lundi!$G269))","v":""}]
[{"$f":"IF(AND(Lundi!$D270=\"\",Lundi!$G270=\"\"),\"\",IF(Lundi!$D270=\"Récréation\",\"RECREATION\",\"Matière : \"&Lundi!$D270&\" \"&\"Compétences : \"&Lundi!$G270))","v":""}]
[{"$f":"IF(AND(Lundi!$D271=\"\",Lundi!$G271=\"\"),\"\",IF(Lundi!$D271=\"Récréation\",\"RECREATION\",\"Matière : \"&Lundi!$D271&\" \"&\"Compétences : \"&Lundi!$G271))","v":""}]
[{"$f":"IF(AND(Lundi!$D272=\"\",Lundi!$G272=\"\"),\"\",IF(Lundi!$D272=\"Récréation\",\"RECREATION\",\"Matière : \"&Lundi!$D272&\" \"&\"Compétences : \"&Lundi!$G272))","v":""}]
[{"$f":"IF(AND(Lundi!$D273=\"\",Lundi!$G273=\"\"),\"\",IF(Lundi!$D273=\"Récréation\",\"RECREATION\",\"Matière : \"&Lundi!$D273&\" \"&\"Compétences : \"&Lundi!$G273))","v":""}]
[{"$f":"IF(AND(Lundi!$D274=\"\",Lundi!$G274=\"\"),\"\",IF(Lundi!$D274=\"Récréation\",\"RECREATION\",\"Matière : \"&Lundi!$D274&\" \"&\"Compétences : \"&Lundi!$G274))","v":""}]
[{"$f":"IF(AND(Lundi!$D275=\"\",Lundi!$G275=\"\"),\"\",IF(Lundi!$D275=\"Récréation\",\"RECREATION\",\"Matière : \"&Lundi!$D275&\" \"&\"Compétences : \"&Lundi!$G275))","v":""}]
[{"$f":"IF(AND(Lundi!$D276=\"\",Lundi!$G276=\"\"),\"\",IF(Lundi!$D276=\"Récréation\",\"RECREATION\",\"Matière : \"&Lundi!$D276&\" \"&\"Compétences : \"&Lundi!$G276))","v":""}]
[{"$f":"IF(AND(Lundi!$D277=\"\",Lundi!$G277=\"\"),\"\",IF(Lundi!$D277=\"Récréation\",\"RECREATION\",\"Matière : \"&Lundi!$D277&\" \"&\"Compétences : \"&Lundi!$G277))","v":""}]

{"sheet":"Planning annuel","index":11,"n_rows":70,"n_cols":19,"rows_kept":70,"cut":false,"hidden":false,"merged":[[38,10,38,11],[35,3,36,4],[35,5,36,6],[35,7,36,8],[38,0,38,1],[38,2,38,3],[38,4,38,5],[38,6,38,7],[38,8,38,9],[0,0,1,11],[2,0,2,1],[2,2,2,3],[2,4,2,5],[2,6,2,7],[2,8,2,9],[2,10,2,11]]}
["Planning Annuel"]
[]
[" Août",null," Septembre",null,"Octobre",null,"Novembre",null,"Décembre",null,"Janvier"]
[{"$f":"DATE($D$36,8,1)","v":"2017-08-01"},null,{"$f":"DATE($D$36,9,1)","v":"2017-09-01"},null,{"$f":"DATE($D$36,10,1)","v":"2017-10-01"},null,{"$f":"DATE($D$36,11,1)","v":"2017-11-01"},null,{"$f":"DATE($D$36,12,1)","v":"2017-12-01"},null,{"$f":"DATE($H$36,1,1)","v":"2018-01-01"}]
[{"$f":"DATE($D$36,8,DAY($A4)+1)","v":"2017-08-02"},null,{"$f":"DATE($D$36,9,DAY($C4)+1)","v":"2017-09-02"},null,{"$f":"DATE($D$36,10,DAY($E4)+1)","v":"2017-10-02"},null,{"$f":"DATE($D$36,11,DAY($G4)+1)","v":"2017-11-02"},null,{"$f":"DATE($D$36,12,DAY($I4)+1)","v":"2017-12-02"},null,{"$f":"DATE($H$36,1,DAY($K4)+1)","v":"2018-01-02"}]
["2017-08-03",null,"2017-09-03",null,"2017-10-03",null,"2017-11-03",null,"2017-12-03",null,"2018-01-03",null,null,null,null,null,null,1,"K4:L34"]
["2017-08-04",null,"2017-09-04",null,"2017-10-04",null,"2017-11-04",null,"2017-12-04",null,"2018-01-04",null,null,null,null,null,null,2,"A40:B67"]
["2017-08-05",null,"2017-09-05",null,"2017-10-05",null,"2017-11-05",null,"2017-12-05",null,"2018-01-05",null,null,null,null,null,null,3,"C40:D70"]
["2017-08-06",null,"2017-09-06",null,"2017-10-06",null,"2017-11-06",null,"2017-12-06",null,"2018-01-06",null,null,null,null,null,null,4,"E40:F69"]
["2017-08-07",null,"2017-09-07",null,"2017-10-07",null,"2017-11-07",null,"2017-12-07",null,"2018-01-07",null,null,null,null,null,null,5,"G40:H70"]
["2017-08-08",null,"2017-09-08",null,"2017-10-08",null,"2017-11-08",null,"2017-12-08",null,"2018-01-08",null,null,null,null,null,null,6,"I40:J69"]
["2017-08-09",null,"2017-09-09",null,"2017-10-09",null,"2017-11-09",null,"2017-12-09",null,"2018-01-09",null,null,null,null,null,null,7,"K40:L70"]
["2017-08-10",null,"2017-09-10",null,"2017-10-10",null,"2017-11-10",null,"2017-12-10",null,"2018-01-10",null,null,null,null,null,null,8,"A4:B34"]
["2017-08-11",null,"2017-09-11",null,"2017-10-11",null,"2017-11-11",null,"2017-12-11",null,"2018-01-11",null,null,null,null,null,null,9,"C4:D33"]
["2017-08-12",null,"2017-09-12",null,"2017-10-12",null,"2017-11-12",null,"2017-12-12",null,"2018-01-12",null,null,null,null,null,null,10,"E4:F34"]
["2017-08-13",null,"2017-09-13",null,"2017-10-13",null,"2017-11-13",null,"2017-12-13",null,"2018-01-13",null,null,null,null,null,null,11,"G4:H33"]
["2017-08-14",null,"2017-09-14",null,"2017-10-14",null,"2017-11-14",null,"2017-12-14",null,"2018-01-14",null,null,null,null,null,null,12,"I4:J34"]
["2017-08-15",null,"2017-09-15",null,"2017-10-15",null,"2017-11-15",null,"2017-12-15",null,"2018-01-15"]
["2017-08-16",null,"2017-09-16",null,"2017-10-16",null,"2017-11-16",null,"2017-12-16",null,"2018-01-16"]
["2017-08-17",null,"2017-09-17",null,"2017-10-17",null,"2017-11-17",null,"2017-12-17",null,"2018-01-17"]
["2017-08-18",null,"2017-09-18",null,"2017-10-18",null,"2017-11-18",null,"2017-12-18",null,"2018-01-18",null,null,null,null,null,"mois","liste","évènements"]
["2017-08-19",null,"2017-09-19",null,"2017-10-19",null,"2017-11-19",null,"2017-12-19",null,"2018-01-19",null,null,null,"lundi",{"$f":"Lundi!B4","v":"2017-06-05"},{"$f":"MONTH(P22)","v":6},{"$f":"VLOOKUP(Q22,$R$6:$S$17,2)","v":"I40:J69"},{"$f":"VLOOKUP(P22,INDIRECT(R22),2)","v":{"$error":"#N/A"}}]
["2017-08-20",null,"2017-09-20",null,"2017-10-20",null,"2017-11-20",null,"2017-12-20",null,"2018-01-20",null,null,null,"mardi",{"$f":"Mardi!B4","v":"2017-06-06"},{"$f":"MONTH(P23)","v":6},{"$f":"VLOOKUP(Q23,$R$6:$S$17,2)","v":"I40:J69"},{"$f":"VLOOKUP(P23,INDIRECT(R23),2)","v":{"$error":"#N/A"}}]
["2017-08-21",null,"2017-09-21",null,"2017-10-21",null,"2017-11-21",null,"2017-12-21",null,"2018-01-21",null,null,null,"mercredi",{"$f":"Mercredi!B4","v":"2017-06-07"},6,"I40:J69",{"$f":"VLOOKUP(P24,INDIRECT(R24),2)","v":{"$error":"#N/A"}}]
["2017-08-22",null,"2017-09-22",null,"2017-10-22",null,"2017-11-22",null,"2017-12-22",null,"2018-01-22",null,null,null,"jeudi",{"$f":"Jeudi!B4","v":"2017-06-08"},6,"I40:J69",{"$f":"VLOOKUP(P25,INDIRECT(R25),2)","v":{"$error":"#N/A"}}]
["2017-08-23",null,"2017-09-23",null,"2017-10-23",null,"2017-11-23",null,"2017-12-23",null,"2018-01-23",null,null,null,"vendredi",{"$f":"Vendredi!B4","v":"2017-06-09"},6,"I40:J69",{"$f":"VLOOKUP(P26,INDIRECT(R26),2)","v":{"$error":"#N/A"}}]
["2017-08-24",null,"2017-09-24",null,"2017-10-24",null,"2017-11-24",null,"2017-12-24",null,"2018-01-24"]
["2017-08-25",null,"2017-09-25",null,"2017-10-25",null,"2017-11-25",null,"2017-12-25",null,"2018-01-25"]
["2017-08-26",null,"2017-09-26",null,"2017-10-26",null,"2017-11-26",null,"2017-12-26",null,"2018-01-26"]
["2017-08-27",null,"2017-09-27",null,"2017-10-27",null,"2017-11-27",null,"2017-12-27",null,"2018-01-27"]
["2017-08-28",null,"2017-09-28",null,"2017-10-28",null,"2017-11-28",null,"2017-12-28",null,"2018-01-28"]
["2017-08-29",null,"2017-09-29",null,"2017-10-29",null,"2017-11-29",null,"2017-12-29",null,"2018-01-29"]
["2017-08-30",null,"2017-09-30",null,"2017-10-30",null,"2017-11-30",null,"2017-12-30",null,"2018-01-30"]
["2017-08-31",null,null,null,"2017-10-31",null,null,null,"2017-12-31",null,"2018-01-31"]
[]
[null,"Aujourd’hui",null,{"$f":"Configuration!A7","v":2017},null,"-",null,{"$f":"Configuration!C7","v":2018},null,null,null,"Vacances scolaires"]
[null,null,null,null,null,null,null,null,null,null,null,"Jours Fériés"]
[]
["Février",null,"Mars",null,"Avril",null,"Mai",null,"Juin",null,"Juillet"]
[{"$f":"DATE($H$36,2,1)","v":"2018-02-01"},null,{"$f":"DATE($H$36,3,1)","v":"2018-03-01"},null,{"$f":"DATE($H$36,4,1)","v":"2018-04-01"},null,{"$f":"DATE($H$36,5,1)","v":"2018-05-01"},null,{"$f":"DATE($H$36,6,1)","v":"2018-06-01"},null,{"$f":"DATE($H$36,7,1)","v":"2018-07-01"}]
[{"$f":"DATE($H$36,2,DAY($A40)+1)","v":"2018-02-02"},null,{"$f":"DATE($H$36,3,DAY($C40)+1)","v":"2018-03-02"},null,{"$f":"DATE($H$36,4,DAY($E40)+1)","v":"2018-04-02"},null,{"$f":"DATE($H$36,5,DAY($G40)+1)","v":"2018-05-02"},null,{"$f":"DATE($H$36,6,DAY($I40)+1)","v":"2018-06-02"},null,{"$f":"DATE($H$36,7,DAY($K40)+1)","v":"2018-07-02"}]
["2018-02-03",null,"2018-03-03",null,"2018-04-03",null,"2018-05-03",null,"2018-06-03",null,"2018-07-03"]
["2018-02-04",null,"2018-03-04",null,"2018-04-04",null,"2018-05-04",null,"2018-06-04",null,"2018-07-04"]
["2018-02-05",null,"2018-03-05",null,"2018-04-05",null,"2018-05-05",null,"2018-06-05",null,"2018-07-05"]
["2018-02-06",null,"2018-03-06",null,"2018-04-06",null,"2018-05-06",null,"2018-06-06",null,"2018-07-06"]
["2018-02-07",null,"2018-03-07",null,"2018-04-07",null,"2018-05-07",null,"2018-06-07",null,"2018-07-07"]
["2018-02-08",null,"2018-03-08",null,"2018-04-08",null,"2018-05-08",null,"2018-06-08",null,"2018-07-08"]
["2018-02-09",null,"2018-03-09",null,"2018-04-09",null,"2018-05-09",null,"2018-06-09",null,"2018-07-09"]
["2018-02-10",null,"2018-03-10",null,"2018-04-10",null,"2018-05-10",null,"2018-06-10",null,"2018-07-10"]
["2018-02-11",null,"2018-03-11",null,"2018-04-11",null,"2018-05-11",null,"2018-06-11",null,"2018-07-11"]
["2018-02-12",null,"2018-03-12",null,"2018-04-12",null,"2018-05-12",null,"2018-06-12",null,"2018-07-12"]
["2018-02-13",null,"2018-03-13",null,"2018-04-13",null,"2018-05-13",null,"2018-06-13",null,"2018-07-13"]
["2018-02-14",null,"2018-03-14",null,"2018-04-14",null,"2018-05-14",null,"2018-06-14",null,"2018-07-14"]
["2018-02-15",null,"2018-03-15",null,"2018-04-15",null,"2018-05-15",null,"2018-06-15",null,"2018-07-15"]
["2018-02-16",null,"2018-03-16",null,"2018-04-16",null,"2018-05-16",null,"2018-06-16",null,"2018-07-16"]
["2018-02-17",null,"2018-03-17",null,"2018-04-17",null,"2018-05-17",null,"2018-06-17",null,"2018-07-17"]
["2018-02-18",null,"2018-03-18",null,"2018-04-18",null,"2018-05-18",null,"2018-06-18",null,"2018-07-18"]
["2018-02-19",null,"2018-03-19",null,"2018-04-19",null,"2018-05-19",null,"2018-06-19",null,"2018-07-19"]
["2018-02-20",null,"2018-03-20",null,"2018-04-20",null,"2018-05-20",null,"2018-06-20",null,"2018-07-20"]
["2018-02-21",null,"2018-03-21",null,"2018-04-21",null,"2018-05-21",null,"2018-06-21",null,"2018-07-21"]
["2018-02-22",null,"2018-03-22",null,"2018-04-22",null,"2018-05-22",null,"2018-06-22",null,"2018-07-22"]
["2018-02-23",null,"2018-03-23",null,"2018-04-23",null,"2018-05-23",null,"2018-06-23",null,"2018-07-23"]
["2018-02-24",null,"2018-03-24",null,"2018-04-24",null,"2018-05-24",null,"2018-06-24",null,"2018-07-24"]
["2018-02-25",null,"2018-03-25",null,"2018-04-25",null,"2018-05-25",null,"2018-06-25",null,"2018-07-25"]
["2018-02-26",null,"2018-03-26",null,"2018-04-26",null,"2018-05-26",null,"2018-06-26",null,"2018-07-26"]
["2018-02-27",null,"2018-03-27",null,"2018-04-27",null,"2018-05-27",null,"2018-06-27",null,"2018-07-27"]
["2018-02-28",null,"2018-03-28",null,"2018-04-28",null,"2018-05-28",null,"2018-06-28",null,"2018-07-28"]
[{"$f":"IF(A67=\"\",\"\",IF(MONTH(A67+1)>MONTH(A67),\"XX\",A67+1))","v":"XX"},null,"2018-03-29",null,"2018-04-29",null,"2018-05-29",null,"2018-06-29",null,"2018-07-29"]
[null,null,"2018-03-30",null,"2018-04-30",null,"2018-05-30",null,"2018-06-30",null,"2018-07-30"]
[null,null,"2018-03-31",null,null,null,"2018-05-31",null,null,null,"2018-07-31"]

{"sheet":"Programmation annuelle","index":12,"n_rows":16,"n_cols":339,"rows_kept":16,"cut":false,"hidden":false,"merged":[[0,6,2,23],[1,1,1,3],[5,0,6,0]]}
[null,null,null,null,null,null,"Mes programmations"]
["Début du calendrier",{"$f":"Configuration!B17","v":"2017-09-04"}]
[]
[null,{"$f":"VLOOKUP(B5,Configuration!$L$7:$M$18,2)","v":"septembre"},{"$f":"IF(C5=\"\",\"\",VLOOKUP(C5,Configuration!$L$7:$M$18,2))","v":""},{"$f":"IF(D5=\"\",\"\",VLOOKUP(D5,Configuration!$L$7:$M$18,2))","v":""},{"$f":"IF(E5=\"\",\"\",VLOOKUP(E5,Configuration!$L$7:$M$18,2))","v":""},{"$f":"IF(F5=\"\",\"\",VLOOKUP(F5,Configuration!$L$7:$M$18,2))","v":""},{"$f":"IF(G5=\"\",\"\",VLOOKUP(G5,Configuration!$L$7:$M$18,2))","v":""},{"$f":"IF(H5=\"\",\"\",VLOOKUP(H5,Configuration!$L$7:$M$18,2))","v":""},{"$f":"IF(I5=\"\",\"\",VLOOKUP(I5,Configuration!$L$7:$M$18,2))","v":""},{"$f":"IF(J5=\"\",\"\",VLOOKUP(J5,Configuration!$L$7:$M$18,2))","v":""},{"$f":"IF(K5=\"\",\"\",VLOOKUP(K5,Configuration!$L$7:$M$18,2))","v":""},{"$f":"IF(L5=\"\",\"\",VLOOKUP(L5,Configuration!$L$7:$M$18,2))","v":""},{"$f":"IF(M5=\"\",\"\",VLOOKUP(M5,Configuration!$L$7:$M$18,2))","v":""},{"$f":"IF(N5=\"\",\"\",VLOOKUP(N5,Configuration!$L$7:$M$18,2))","v":""},{"$f":"IF(O5=\"\",\"\",VLOOKUP(O5,Configuration!$L$7:$M$18,2))","v":""},{"$f":"IF(P5=\"\",\"\",VLOOKUP(P5,Configuration!$L$7:$M$18,2))","v":""},{"$f":"IF(Q5=\"\",\"\",VLOOKUP(Q5,Configuration!$L$7:$M$18,2))","v":""},{"$f":"IF(R5=\"\",\"\",VLOOKUP(R5,Configuration!$L$7:$M$18,2))","v":""},{"$f":"IF(S5=\"\",\"\",VLOOKUP(S5,Configuration!$L$7:$M$18,2))","v":""},{"$f":"IF(T5=\"\",\"\",VLOOKUP(T5,Configuration!$L$7:$M$18,2))","v":""},{"$f":"IF(U5=\"\",\"\",VLOOKUP(U5,Configuration!$L$7:$M$18,2))","v":""},{"$f":"IF(V5=\"\",\"\",VLOOKUP(V5,Configuration!$L$7:$M$18,2))","v":""},{"$f":"IF(W5=\"\",\"\",VLOOKUP(W5,Configuration!$L$7:$M$18,2))","v":""},{"$f":"IF(X5=\"\",\"\",VLOOKUP(X5,Configuration!$L$7:$M$18,2))","v":""},{"$f":"IF(Y5=\"\",\"\",VLOOKUP(Y5,Configuration!$L$7:$M$18,2))","v":""},{"$f":"IF(Z5=\"\",\"\",VLOOKUP(Z5,Configuration!$L$7:$M$18,2))","v":""},{"$f":"IF(AA5=\"\",\"\",VLOOKUP(AA5,Configuration!$L$7:$M$18,2))","v":""},{"$f":"IF(AB5=\"\",\"\",VLOOKUP(AB5,Configuration!$L$7:$M$18,2))","v":""},{"$f":"IF(AC5=\"\",\"\",VLOOKUP(AC5,Configuration!$L$7:$M$18,2))","v":"octobre"},{"$f":"IF(AD5=\"\",\"\",VLOOKUP(AD5,Configuration!$L$7:$M$18,2))","v":""},{"$f":"IF(AE5=\"\",\"\",VLOOKUP(AE5,Configuration!$L$7:$M$18,2))","v":""},{"$f":"IF(AF5=\"\",\"\",VLOOKUP(AF5,Configuration!$L$7:$M$18,2))","v":""},{"$f":"IF(AG5=\"\",\"\",VLOOKUP(AG5,Configuration!$L$7:$M$18,2))","v":""},{"$f":"IF(AH5=\"\",\"\",VLOOKUP(AH5,Configuration!$L$7:$M$18,2))","v":""},{"$f":"IF(AI5=\"\",\"\",VLOOKUP(AI5,Configuration!$L$7:$M$18,2))","v":""},{"$f":"IF(AJ5=\"\",\"\",VLOOKUP(AJ5,Configuration!$L$7:$M$18,2))","v":""},{"$f":"IF(AK5=\"\",\"\",VLOOKUP(AK5,Configuration!$L$7:$M$18,2))","v":""},{"$f":"IF(AL5=\"\",\"\",VLOOKUP(AL5,Configuration!$L$7:$M$18,2))","v":""},{"$f":"IF(AM5=\"\",\"\",VLOOKUP(AM5,Configuration!$L$7:$M$18,2))","v":""},{"$f":"IF(AN5=\"\",\"\",VLOOKUP(AN5,Configuration!$L$7:$M$18,2))","v":""},{"$f":"IF(AO5=\"\",\"\",VLOOKUP(AO5,Configuration!$L$7:$M$18,2))","v":""},{"$f":"IF(AP5=\"\",\"\",VLOOKUP(AP5,Configuration!$L$7:$M$18,2))","v":""},{"$f":"IF(AQ5=\"\",\"\",VLOOKUP(AQ5,Configuration!$L$7:$M$18,2))","v":""},{"$f":"IF(AR5=\"\",\"\",VLOOKUP(AR5,Configuration!$L$7:$M$18,2))","v":""},{"$f":"IF(AS5=\"\",\"\",VLOOKUP(AS5,Configuration!$L$7:$M$18,2))","v":""},{"$f":"IF(AT5=\"\",\"\",VLOOKUP(AT5,Configuration!$L$7:$M$18,2))","v":""},{"$f":"IF(AU5=\"\",\"\",VLOOKUP(AU5,Configuration!$L$7:$M$18,2))","v":""},{"$f":"IF(AV5=\"\",\"\",VLOOKUP(AV5,Configuration!$L$7:$M$18,2))","v":""},{"$f":"IF(AW5=\"\",\"\",VLOOKUP(AW5,Configuration!$L$7:$M$18,2))","v":""},{"$f":"IF(AX5=\"\",\"\",VLOOKUP(AX5,Configuration!$L$7:$M$18,2))","v":""},{"$f":"IF(AY5=\"\",\"\",VLOOKUP(AY5,Configuration!$L$7:$M$18,2))","v":""},{"$f":"IF(AZ5=\"\",\"\",VLOOKUP(AZ5,Configuration!$L$7:$M$18,2))","v":""},{"$f":"IF(BA5=\"\",\"\",VLOOKUP(BA5,Configuration!$L$7:$M$18,2))","v":""},{"$f":"IF(BB5=\"\",\"\",VLOOKUP(BB5,Configuration!$L$7:$M$18,2))","v":""},{"$f":"IF(BC5=\"\",\"\",VLOOKUP(BC5,Configuration!$L$7:$M$18,2))","v":""},{"$f":"IF(BD5=\"\",\"\",VLOOKUP(BD5,Configuration!$L$7:$M$18,2))","v":""},{"$f":"IF(BE5=\"\",\"\",VLOOKUP(BE5,Configuration!$L$7:$M$18,2))","v":""},{"$f":"IF(BF5=\"\",\"\",VLOOKUP(BF5,Configuration!$L$7:$M$18,2))","v":""},{"$f":"IF(BG5=\"\",\"\",VLOOKUP(BG5,Configuration!$L$7:$M$18,2))","v":""},{"$f":"IF(BH5=\"\",\"\",VLOOKUP(BH5,Configuration!$L$7:$M$18,2))","v":"novembre"},{"$f":"IF(BI5=\"\",\"\",VLOOKUP(BI5,Configuration!$L$7:$M$18,2))","v":""},{"$f":"IF(BJ5=\"\",\"\",VLOOKUP(BJ5,Configuration!$L$7:$M$18,2))","v":""},{"$f":"IF(BK5=\"\",\"\",VLOOKUP(BK5,Configuration!$L$7:$M$18,2))","v":""},{"$f":"IF(BL5=\"\",\"\",VLOOKUP(BL5,Configuration!$L$7:$M$18,2))","v":""},{"$f":"IF(BM5=\"\",\"\",VLOOKUP(BM5,Configuration!$L$7:$M$18,2))","v":""},{"$f":"IF(BN5=\"\",\"\",VLOOKUP(BN5,Configuration!$L$7:$M$18,2))","v":""},{"$f":"IF(BO5=\"\",\"\",VLOOKUP(BO5,Configuration!$L$7:$M$18,2))","v":""},{"$f":"IF(BP5=\"\",\"\",VLOOKUP(BP5,Configuration!$L$7:$M$18,2))","v":""},{"$f":"IF(BQ5=\"\",\"\",VLOOKUP(BQ5,Configuration!$L$7:$M$18,2))","v":""},{"$f":"IF(BR5=\"\",\"\",VLOOKUP(BR5,Configuration!$L$7:$M$18,2))","v":""},{"$f":"IF(BS5=\"\",\"\",VLOOKUP(BS5,Configuration!$L$7:$M$18,2))","v":""},{"$f":"IF(BT5=\"\",\"\",VLOOKUP(BT5,Configuration!$L$7:$M$18,2))","v":""},{"$f":"IF(BU5=\"\",\"\",VLOOKUP(BU5,Configuration!$L$7:$M$18,2))","v":""},{"$f":"IF(BV5=\"\",\"\",VLOOKUP(BV5,Configuration!$L$7:$M$18,2))","v":""},{"$f":"IF(BW5=\"\",\"\",VLOOKUP(BW5,Configuration!$L$7:$M$18,2))","v":""},{"$f":"IF(BX5=\"\",\"\",VLOOKUP(BX5,Configuration!$L$7:$M$18,2))","v":""},{"$f":"IF(BY5=\"\",\"\",VLOOKUP(BY5,Configuration!$L$7:$M$18,2))","v":""},{"$f":"IF(BZ5=\"\",\"\",VLOOKUP(BZ5,Configuration!$L$7:$M$18,2))","v":""},{"$f":"IF(CA5=\"\",\"\",VLOOKUP(CA5,Configuration!$L$7:$M$18,2))","v":""},{"$f":"IF(CB5=\"\",\"\",VLOOKUP(CB5,Configuration!$L$7:$M$18,2))","v":""},{"$f":"IF(CC5=\"\",\"\",VLOOKUP(CC5,Configuration!$L$7:$M$18,2))","v":""},{"$f":"IF(CD5=\"\",\"\",VLOOKUP(CD5,Configuration!$L$7:$M$18,2))","v":""},{"$f":"IF(CE5=\"\",\"\",VLOOKUP(CE5,Configuration!$L$7:$M$18,2))","v":""},{"$f":"IF(CF5=\"\",\"\",VLOOKUP(CF5,Configuration!$L$7:$M$18,2))","v":""},{"$f":"IF(CG5=\"\",\"\",VLOOKUP(CG5,Configuration!$L$7:$M$18,2))","v":""},{"$f":"IF(CH5=\"\",\"\",VLOOKUP(CH5,Configuration!$L$7:$M$18,2))","v":""},{"$f":"IF(CI5=\"\",\"\",VLOOKUP(CI5,Configuration!$L$7:$M$18,2))","v":""},{"$f":"IF(CJ5=\"\",\"\",VLOOKUP(CJ5,Configuration!$L$7:$M$18,2))","v":""},{"$f":"IF(CK5=\"\",\"\",VLOOKUP(CK5,Configuration!$L$7:$M$18,2))","v":""},{"$f":"IF(CL5=\"\",\"\",VLOOKUP(CL5,Configuration!$L$7:$M$18,2))","v":"décembre"},{"$f":"IF(CM5=\"\",\"\",VLOOKUP(CM5,Configuration!$L$7:$M$18,2))","v":""},{"$f":"IF(CN5=\"\",\"\",VLOOKUP(CN5,Configuration!$L$7:$M$18,2))","v":""},{"$f":"IF(CO5=\"\",\"\",VLOOKUP(CO5,Configuration!$L$7:$M$18,2))","v":""},{"$f":"IF(CP5=\"\",\"\",VLOOKUP(CP5,Configuration!$L$7:$M$18,2))","v":""},{"$f":"IF(CQ5=\"\",\"\",VLOOKUP(CQ5,Configuration!$L$7:$M$18,2))","v":""},{"$f":"IF(CR5=\"\",\"\",VLOOKUP(CR5,Configuration!$L$7:$M$18,2))","v":""},{"$f":"IF(CS5=\"\",\"\",VLOOKUP(CS5,Configuration!$L$7:$M$18,2))","v":""},{"$f":"IF(CT5=\"\",\"\",VLOOKUP(CT5,Configuration!$L$7:$M$18,2))","v":""},{"$f":"IF(CU5=\"\",\"\",VLOOKUP(CU5,Configuration!$L$7:$M$18,2))","v":""},{"$f":"IF(CV5=\"\",\"\",VLOOKUP(CV5,Configuration!$L$7:$M$18,2))","v":""},{"$f":"IF(CW5=\"\",\"\",VLOOKUP(CW5,Configuration!$L$7:$M$18,2))","v":""},{"$f":"IF(CX5=\"\",\"\",VLOOKUP(CX5,Configuration!$L$7:$M$18,2))","v":""},{"$f":"IF(CY5=\"\",\"\",VLOOKUP(CY5,Configuration!$L$7:$M$18,2))","v":""},{"$f":"IF(CZ5=\"\",\"\",VLOOKUP(CZ5,Configuration!$L$7:$M$18,2))","v":""},{"$f":"IF(DA5=\"\",\"\",VLOOKUP(DA5,Configuration!$L$7:$M$18,2))","v":""},{"$f":"IF(DB5=\"\",\"\",VLOOKUP(DB5,Configuration!$L$7:$M$18,2))","v":""},{"$f":"IF(DC5=\"\",\"\",VLOOKUP(DC5,Configuration!$L$7:$M$18,2))","v":""},{"$f":"IF(DD5=\"\",\"\",VLOOKUP(DD5,Configuration!$L$7:$M$18,2))","v":""},{"$f":"IF(DE5=\"\",\"\",VLOOKUP(DE5,Configuration!$L$7:$M$18,2))","v":""},{"$f":"IF(DF5=\"\",\"\",VLOOKUP(DF5,Configuration!$L$7:$M$18,2))","v":""},{"$f":"IF(DG5=\"\",\"\",VLOOKUP(DG5,Configuration!$L$7:$M$18,2))","v":""},{"$f":"IF(DH5=\"\",\"\",VLOOKUP(DH5,Configuration!$L$7:$M$18,2))","v":""},{"$f":"IF(DI5=\"\",\"\",VLOOKUP(DI5,Configuration!$L$7:$M$18,2))","v":""},{"$f":"IF(DJ5=\"\",\"\",VLOOKUP(DJ5,Configuration!$L$7:$M$18,2))","v":""},{"$f":"IF(DK5=\"\",\"\",VLOOKUP(DK5,Configuration!$L$7:$M$18,2))","v":""},{"$f":"IF(DL5=\"\",\"\",VLOOKUP(DL5,Configuration!$L$7:$M$18,2))","v":""},{"$f":"IF(DM5=\"\",\"\",VLOOKUP(DM5,Configuration!$L$7:$M$18,2))","v":""},{"$f":"IF(DN5=\"\",\"\",VLOOKUP(DN5,Configuration!$L$7:$M$18,2))","v":""},{"$f":"IF(DO5=\"\",\"\",VLOOKUP(DO5,Configuration!$L$7:$M$18,2))","v":""},{"$f":"IF(DP5=\"\",\"\",VLOOKUP(DP5,Configuration!$L$7:$M$18,2))","v":""},{"$f":"IF(DQ5=\"\",\"\",VLOOKUP(DQ5,Configuration!$L$7:$M$18,2))","v":"Janvier"},{"$f":"IF(DR5=\"\",\"\",VLOOKUP(DR5,Configuration!$L$7:$M$18,2))","v":""},{"$f":"IF(DS5=\"\",\"\",VLOOKUP(DS5,Configuration!$L$7:$M$18,2))","v":""},{"$f":"IF(DT5=\"\",\"\",VLOOKUP(DT5,Configuration!$L$7:$M$18,2))","v":""},{"$f":"IF(DU5=\"\",\"\",VLOOKUP(DU5,Configuration!$L$7:$M$18,2))","v":""},{"$f":"IF(DV5=\"\",\"\",VLOOKUP(DV5,Configuration!$L$7:$M$18,2))","v":""},{"$f":"IF(DW5=\"\",\"\",VLOOKUP(DW5,Configuration!$L$7:$M$18,2))","v":""},{"$f":"IF(DX5=\"\",\"\",VLOOKUP(DX5,Configuration!$L$7:$M$18,2))","v":""},{"$f":"IF(DY5=\"\",\"\",VLOOKUP(DY5,Configuration!$L$7:$M$18,2))","v":""},{"$f":"IF(DZ5=\"\",\"\",VLOOKUP(DZ5,Configuration!$L$7:$M$18,2))","v":""},{"$f":"IF(EA5=\"\",\"\",VLOOKUP(EA5,Configuration!$L$7:$M$18,2))","v":""},{"$f":"IF(EB5=\"\",\"\",VLOOKUP(EB5,Configuration!$L$7:$M$18,2))","v":""},{"$f":"IF(EC5=\"\",\"\",VLOOKUP(EC5,Configuration!$L$7:$M$18,2))","v":""},{"$f":"IF(ED5=\"\",\"\",VLOOKUP(ED5,Configuration!$L$7:$M$18,2))","v":""},{"$f":"IF(EE5=\"\",\"\",VLOOKUP(EE5,Configuration!$L$7:$M$18,2))","v":""},{"$f":"IF(EF5=\"\",\"\",VLOOKUP(EF5,Configuration!$L$7:$M$18,2))","v":""},{"$f":"IF(EG5=\"\",\"\",VLOOKUP(EG5,Configuration!$L$7:$M$18,2))","v":""},{"$f":"IF(EH5=\"\",\"\",VLOOKUP(EH5,Configuration!$L$7:$M$18,2))","v":""},{"$f":"IF(EI5=\"\",\"\",VLOOKUP(EI5,Configuration!$L$7:$M$18,2))","v":""},{"$f":"IF(EJ5=\"\",\"\",VLOOKUP(EJ5,Configuration!$L$7:$M$18,2))","v":""},{"$f":"IF(EK5=\"\",\"\",VLOOKUP(EK5,Configuration!$L$7:$M$18,2))","v":""},{"$f":"IF(EL5=\"\",\"\",VLOOKUP(EL5,Configuration!$L$7:$M$18,2))","v":""},{"$f":"IF(EM5=\"\",\"\",VLOOKUP(EM5,Configuration!$L$7:$M$18,2))","v":""},{"$f":"IF(EN5=\"\",\"\",VLOOKUP(EN5,Configuration!$L$7:$M$18,2))","v":""},{"$f":"IF(EO5=\"\",\"\",VLOOKUP(EO5,Configuration!$L$7:$M$18,2))","v":""},{"$f":"IF(EP5=\"\",\"\",VLOOKUP(EP5,Configuration!$L$7:$M$18,2))","v":""},{"$f":"IF(EQ5=\"\",\"\",VLOOKUP(EQ5,Configuration!$L$7:$M$18,2))","v":""},{"$f":"IF(ER5=\"\",\"\",VLOOKUP(ER5,Configuration!$L$7:$M$18,2))","v":""},{"$f":"IF(ES5=\"\",\"\",VLOOKUP(ES5,Configuration!$L$7:$M$18,2))","v":""},{"$f":"IF(ET5=\"\",\"\",VLOOKUP(ET5,Configuration!$L$7:$M$18,2))","v":""},{"$f":"IF(EU5=\"\",\"\",VLOOKUP(EU5,Configuration!$L$7:$M$18,2))","v":""},{"$f":"IF(EV5=\"\",\"\",VLOOKUP(EV5,Configuration!$L$7:$M$18,2))","v":"février"},{"$f":"IF(EW5=\"\",\"\",VLOOKUP(EW5,Configuration!$L$7:$M$18,2))","v":""},{"$f":"IF(EX5=\"\",\"\",VLOOKUP(EX5,Configuration!$L$7:$M$18,2))","v":""},{"$f":"IF(EY5=\"\",\"\",VLOOKUP(EY5,Configuration!$L$7:$M$18,2))","v":""},{"$f":"IF(EZ5=\"\",\"\",VLOOKUP(EZ5,Configuration!$L$7:$M$18,2))","v":""},{"$f":"IF(FA5=\"\",\"\",VLOOKUP(FA5,Configuration!$L$7:$M$18,2))","v":""},{"$f":"IF(FB5=\"\",\"\",VLOOKUP(FB5,Configuration!$L$7:$M$18,2))","v":""},{"$f":"IF(FC5=\"\",\"\",VLOOKUP(FC5,Configuration!$L$7:$M$18,2))","v":""},{"$f":"IF(FD5=\"\",\"\",VLOOKUP(FD5,Configuration!$L$7:$M$18,2))","v":""},{"$f":"IF(FE5=\"\",\"\",VLOOKUP(FE5,Configuration!$L$7:$M$18,2))","v":""},{"$f":"IF(FF5=\"\",\"\",VLOOKUP(FF5,Configuration!$L$7:$M$18,2))","v":""},{"$f":"IF(FG5=\"\",\"\",VLOOKUP(FG5,Configuration!$L$7:$M$18,2))","v":""},{"$f":"IF(FH5=\"\",\"\",VLOOKUP(FH5,Configuration!$L$7:$M$18,2))","v":""},{"$f":"IF(FI5=\"\",\"\",VLOOKUP(FI5,Configuration!$L$7:$M$18,2))","v":""},{"$f":"IF(FJ5=\"\",\"\",VLOOKUP(FJ5,Configuration!$L$7:$M$18,2))","v":""},{"$f":"IF(FK5=\"\",\"\",VLOOKUP(FK5,Configuration!$L$7:$M$18,2))","v":""},{"$f":"IF(FL5=\"\",\"\",VLOOKUP(FL5,Configuration!$L$7:$M$18,2))","v":""},{"$f":"IF(FM5=\"\",\"\",VLOOKUP(FM5,Configuration!$L$7:$M$18,2))","v":""},{"$f":"IF(FN5=\"\",\"\",VLOOKUP(FN5,Configuration!$L$7:$M$18,2))","v":""},{"$f":"IF(FO5=\"\",\"\",VLOOKUP(FO5,Configuration!$L$7:$M$18,2))","v":""},{"$f":"IF(FP5=\"\",\"\",VLOOKUP(FP5,Configuration!$L$7:$M$18,2))","v":""},{"$f":"IF(FQ5=\"\",\"\",VLOOKUP(FQ5,Configuration!$L$7:$M$18,2))","v":""},{"$f":"IF(FR5=\"\",\"\",VLOOKUP(FR5,Configuration!$L$7:$M$18,2))","v":""},{"$f":"IF(FS5=\"\",\"\",VLOOKUP(FS5,Configuration!$L$7:$M$18,2))","v":""},{"$f":"IF(FT5=\"\",\"\",VLOOKUP(FT5,Configuration!$L$7:$M$18,2))","v":""},{"$f":"IF(FU5=\"\",\"\",VLOOKUP(FU5,Configuration!$L$7:$M$18,2))","v":""},{"$f":"IF(FV5=\"\",\"\",VLOOKUP(FV5,Configuration!$L$7:$M$18,2))","v":""},{"$f":"IF(FW5=\"\",\"\",VLOOKUP(FW5,Configuration!$L$7:$M$18,2))","v":""},{"$f":"IF(FX5=\"\",\"\",VLOOKUP(FX5,Configuration!$L$7:$M$18,2))","v":"mars"},{"$f":"IF(FY5=\"\",\"\",VLOOKUP(FY5,Configuration!$L$7:$M$18,2))","v":""},{"$f":"IF(FZ5=\"\",\"\",VLOOKUP(FZ5,Configuration!$L$7:$M$18,2))","v":""},{"$f":"IF(GA5=\"\",\"\",VLOOKUP(GA5,Configuration!$L$7:$M$18,2))","v":""},{"$f":"IF(GB5=\"\",\"\",VLOOKUP(GB5,Configuration!$L$7:$M$18,2))","v":""},{"$f":"IF(GC5=\"\",\"\",VLOOKUP(GC5,Configuration!$L$7:$M$18,2))","v":""},{"$f":"IF(GD5=\"\",\"\",VLOOKUP(GD5,Configuration!$L$7:$M$18,2))","v":""},{"$f":"IF(GE5=\"\",\"\",VLOOKUP(GE5,Configuration!$L$7:$M$18,2))","v":""},{"$f":"IF(GF5=\"\",\"\",VLOOKUP(GF5,Configuration!$L$7:$M$18,2))","v":""},{"$f":"IF(GG5=\"\",\"\",VLOOKUP(GG5,Configuration!$L$7:$M$18,2))","v":""},{"$f":"IF(GH5=\"\",\"\",VLOOKUP(GH5,Configuration!$L$7:$M$18,2))","v":""},{"$f":"IF(GI5=\"\",\"\",VLOOKUP(GI5,Configuration!$L$7:$M$18,2))","v":""},{"$f":"IF(GJ5=\"\",\"\",VLOOKUP(GJ5,Configuration!$L$7:$M$18,2))","v":""},{"$f":"IF(GK5=\"\",\"\",VLOOKUP(GK5,Configuration!$L$7:$M$18,2))","v":""},{"$f":"IF(GL5=\"\",\"\",VLOOKUP(GL5,Configuration!$L$7:$M$18,2))","v":""},{"$f":"IF(GM5=\"\",\"\",VLOOKUP(GM5,Configuration!$L$7:$M$18,2))","v":""},{"$f":"IF(GN5=\"\",\"\",VLOOKUP(GN5,Configuration!$L$7:$M$18,2))","v":""},{"$f":"IF(GO5=\"\",\"\",VLOOKUP(GO5,Configuration!$L$7:$M$18,2))","v":""},{"$f":"IF(GP5=\"\",\"\",VLOOKUP(GP5,Configuration!$L$7:$M$18,2))","v":""},{"$f":"IF(GQ5=\"\",\"\",VLOOKUP(GQ5,Configuration!$L$7:$M$18,2))","v":""},{"$f":"IF(GR5=\"\",\"\",VLOOKUP(GR5,Configuration!$L$7:$M$18,2))","v":""},{"$f":"IF(GS5=\"\",\"\",VLOOKUP(GS5,Configuration!$L$7:$M$18,2))","v":""},{"$f":"IF(GT5=\"\",\"\",VLOOKUP(GT5,Configuration!$L$7:$M$18,2))","v":""},{"$f":"IF(GU5=\"\",\"\",VLOOKUP(GU5,Configuration!$L$7:$M$18,2))","v":""},{"$f":"IF(GV5=\"\",\"\",VLOOKUP(GV5,Configuration!$L$7:$M$18,2))","v":""},{"$f":"IF(GW5=\"\",\"\",VLOOKUP(GW5,Configuration!$L$7:$M$18,2))","v":""},{"$f":"IF(GX5=\"\",\"\",VLOOKUP(GX5,Configuration!$L$7:$M$18,2))","v":""},{"$f":"IF(GY5=\"\",\"\",VLOOKUP(GY5,Configuration!$L$7:$M$18,2))","v":""},{"$f":"IF(GZ5=\"\",\"\",VLOOKUP(GZ5,Configuration!$L$7:$M$18,2))","v":""},{"$f":"IF(HA5=\"\",\"\",VLOOKUP(HA5,Configuration!$L$7:$M$18,2))","v":""},{"$f":"IF(HB5=\"\",\"\",VLOOKUP(HB5,Configuration!$L$7:$M$18,2))","v":""},{"$f":"IF(HC5=\"\",\"\",VLOOKUP(HC5,Configuration!$L$7:$M$18,2))","v":"avril"},{"$f":"IF(HD5=\"\",\"\",VLOOKUP(HD5,Configuration!$L$7:$M$18,2))","v":""},{"$f":"IF(HE5=\"\",\"\",VLOOKUP(HE5,Configuration!$L$7:$M$18,2))","v":""},{"$f":"IF(HF5=\"\",\"\",VLOOKUP(HF5,Configuration!$L$7:$M$18,2))","v":""},{"$f":"IF(HG5=\"\",\"\",VLOOKUP(HG5,Configuration!$L$7:$M$18,2))","v":""},{"$f":"IF(HH5=\"\",\"\",VLOOKUP(HH5,Configuration!$L$7:$M$18,2))","v":""},{"$f":"IF(HI5=\"\",\"\",VLOOKUP(HI5,Configuration!$L$7:$M$18,2))","v":""},{"$f":"IF(HJ5=\"\",\"\",VLOOKUP(HJ5,Configuration!$L$7:$M$18,2))","v":""},{"$f":"IF(HK5=\"\",\"\",VLOOKUP(HK5,Configuration!$L$7:$M$18,2))","v":""},{"$f":"IF(HL5=\"\",\"\",VLOOKUP(HL5,Configuration!$L$7:$M$18,2))","v":""},{"$f":"IF(HM5=\"\",\"\",VLOOKUP(HM5,Configuration!$L$7:$M$18,2))","v":""},{"$f":"IF(HN5=\"\",\"\",VLOOKUP(HN5,Configuration!$L$7:$M$18,2))","v":""},{"$f":"IF(HO5=\"\",\"\",VLOOKUP(HO5,Configuration!$L$7:$M$18,2))","v":""},{"$f":"IF(HP5=\"\",\"\",VLOOKUP(HP5,Configuration!$L$7:$M$18,2))","v":""},{"$f":"IF(HQ5=\"\",\"\",VLOOKUP(HQ5,Configuration!$L$7:$M$18,2))","v":""},{"$f":"IF(HR5=\"\",\"\",VLOOKUP(HR5,Configuration!$L$7:$M$18,2))","v":""},{"$f":"IF(HS5=\"\",\"\",VLOOKUP(HS5,Configuration!$L$7:$M$18,2))","v":""},{"$f":"IF(HT5=\"\",\"\",VLOOKUP(HT5,Configuration!$L$7:$M$18,2))","v":""},{"$f":"IF(HU5=\"\",\"\",VLOOKUP(HU5,Configuration!$L$7:$M$18,2))","v":""},{"$f":"IF(HV5=\"\",\"\",VLOOKUP(HV5,Configuration!$L$7:$M$18,2))","v":""},{"$f":"IF(HW5=\"\",\"\",VLOOKUP(HW5,Configuration!$L$7:$M$18,2))","v":""},{"$f":"IF(HX5=\"\",\"\",VLOOKUP(HX5,Configuration!$L$7:$M$18,2))","v":""},{"$f":"IF(HY5=\"\",\"\",VLOOKUP(HY5,Configuration!$L$7:$M$18,2))","v":""},{"$f":"IF(HZ5=\"\",\"\",VLOOKUP(HZ5,Configuration!$L$7:$M$18,2))","v":""},{"$f":"IF(IA5=\"\",\"\",VLOOKUP(IA5,Configuration!$L$7:$M$18,2))","v":""},{"$f":"IF(IB5=\"\",\"\",VLOOKUP(IB5,Configuration!$L$7:$M$18,2))","v":""},{"$f":"IF(IC5=\"\",\"\",VLOOKUP(IC5,Configuration!$L$7:$M$18,2))","v":""},{"$f":"IF(ID5=\"\",\"\",VLOOKUP(ID5,Configuration!$L$7:$M$18,2))","v":""},{"$f":"IF(IE5=\"\",\"\",VLOOKUP(IE5,Configuration!$L$7:$M$18,2))","v":""},{"$f":"IF(IF5=\"\",\"\",VLOOKUP(IF5,Configuration!$L$7:$M$18,2))","v":""},{"$f":"IF(IG5=\"\",\"\",VLOOKUP(IG5,Configuration!$L$7:$M$18,2))","v":"mai"},{"$f":"IF(IH5=\"\",\"\",VLOOKUP(IH5,Configuration!$L$7:$M$18,2))","v":""},{"$f":"IF(II5=\"\",\"\",VLOOKUP(II5,Configuration!$L$7:$M$18,2))","v":""},{"$f":"IF(IJ5=\"\",\"\",VLOOKUP(IJ5,Configuration!$L$7:$M$18,2))","v":""},{"$f":"IF(IK5=\"\",\"\",VLOOKUP(IK5,Configuration!$L$7:$M$18,2))","v":""},{"$f":"IF(IL5=\"\",\"\",VLOOKUP(IL5,Configuration!$L$7:$M$18,2))","v":""},{"$f":"IF(IM5=\"\",\"\",VLOOKUP(IM5,Configuration!$L$7:$M$18,2))","v":""},{"$f":"IF(IN5=\"\",\"\",VLOOKUP(IN5,Configuration!$L$7:$M$18,2))","v":""},{"$f":"IF(IO5=\"\",\"\",VLOOKUP(IO5,Configuration!$L$7:$M$18,2))","v":""},{"$f":"IF(IP5=\"\",\"\",VLOOKUP(IP5,Configuration!$L$7:$M$18,2))","v":""},{"$f":"IF(IQ5=\"\",\"\",VLOOKUP(IQ5,Configuration!$L$7:$M$18,2))","v":""},{"$f":"IF(IR5=\"\",\"\",VLOOKUP(IR5,Configuration!$L$7:$M$18,2))","v":""},{"$f":"IF(IS5=\"\",\"\",VLOOKUP(IS5,Configuration!$L$7:$M$18,2))","v":""},{"$f":"IF(IT5=\"\",\"\",VLOOKUP(IT5,Configuration!$L$7:$M$18,2))","v":""},{"$f":"IF(IU5=\"\",\"\",VLOOKUP(IU5,Configuration!$L$7:$M$18,2))","v":""},{"$f":"IF(IV5=\"\",\"\",VLOOKUP(IV5,Configuration!$L$7:$M$18,2))","v":""},{"$f":"IF(IW5=\"\",\"\",VLOOKUP(IW5,Configuration!$L$7:$M$18,2))","v":""},{"$f":"IF(IX5=\"\",\"\",VLOOKUP(IX5,Configuration!$L$7:$M$18,2))","v":""},{"$f":"IF(IY5=\"\",\"\",VLOOKUP(IY5,Configuration!$L$7:$M$18,2))","v":""},{"$f":"IF(IZ5=\"\",\"\",VLOOKUP(IZ5,Configuration!$L$7:$M$18,2))","v":""},{"$f":"IF(JA5=\"\",\"\",VLOOKUP(JA5,Configuration!$L$7:$M$18,2))","v":""},{"$f":"IF(JB5=\"\",\"\",VLOOKUP(JB5,Configuration!$L$7:$M$18,2))","v":""},{"$f":"IF(JC5=\"\",\"\",VLOOKUP(JC5,Configuration!$L$7:$M$18,2))","v":""},{"$f":"IF(JD5=\"\",\"\",VLOOKUP(JD5,Configuration!$L$7:$M$18,2))","v":""},{"$f":"IF(JE5=\"\",\"\",VLOOKUP(JE5,Configuration!$L$7:$M$18,2))","v":""},{"$f":"IF(JF5=\"\",\"\",VLOOKUP(JF5,Configuration!$L$7:$M$18,2))","v":""},{"$f":"IF(JG5=\"\",\"\",VLOOKUP(JG5,Configuration!$L$7:$M$18,2))","v":""},{"$f":"IF(JH5=\"\",\"\",VLOOKUP(JH5,Configuration!$L$7:$M$18,2))","v":""},{"$f":"IF(JI5=\"\",\"\",VLOOKUP(JI5,Configuration!$L$7:$M$18,2))","v":""},{"$f":"IF(JJ5=\"\",\"\",VLOOKUP(JJ5,Configuration!$L$7:$M$18,2))","v":""},{"$f":"IF(JK5=\"\",\"\",VLOOKUP(JK5,Configuration!$L$7:$M$18,2))","v":""},{"$f":"IF(JL5=\"\",\"\",VLOOKUP(JL5,Configuration!$L$7:$M$18,2))","v":"juin"},{"$f":"IF(JM5=\"\",\"\",VLOOKUP(JM5,Configuration!$L$7:$M$18,2))","v":""},{"$f":"IF(JN5=\"\",\"\",VLOOKUP(JN5,Configuration!$L$7:$M$18,2))","v":""},{"$f":"IF(JO5=\"\",\"\",VLOOKUP(JO5,Configuration!$L$7:$M$18,2))","v":""},{"$f":"IF(JP5=\"\",\"\",VLOOKUP(JP5,Configuration!$L$7:$M$18,2))","v":""},{"$f":"IF(JQ5=\"\",\"\",VLOOKUP(JQ5,Configuration!$L$7:$M$18,2))","v":""},{"$f":"IF(JR5=\"\",\"\",VLOOKUP(JR5,Configuration!$L$7:$M$18,2))","v":""},{"$f":"IF(JS5=\"\",\"\",VLOOKUP(JS5,Configuration!$L$7:$M$18,2))","v":""},{"$f":"IF(JT5=\"\",\"\",VLOOKUP(JT5,Configuration!$L$7:$M$18,2))","v":""},{"$f":"IF(JU5=\"\",\"\",VLOOKUP(JU5,Configuration!$L$7:$M$18,2))","v":""},{"$f":"IF(JV5=\"\",\"\",VLOOKUP(JV5,Configuration!$L$7:$M$18,2))","v":""},{"$f":"IF(JW5=\"\",\"\",VLOOKUP(JW5,Configuration!$L$7:$M$18,2))","v":""},{"$f":"IF(JX5=\"\",\"\",VLOOKUP(JX5,Configuration!$L$7:$M$18,2))","v":""},{"$f":"IF(JY5=\"\",\"\",VLOOKUP(JY5,Configuration!$L$7:$M$18,2))","v":""},{"$f":"IF(JZ5=\"\",\"\",VLOOKUP(JZ5,Configuration!$L$7:$M$18,2))","v":""},{"$f":"IF(KA5=\"\",\"\",VLOOKUP(KA5,Configuration!$L$7:$M$18,2))","v":""},{"$f":"IF(KB5=\"\",\"\",VLOOKUP(KB5,Configuration!$L$7:$M$18,2))","v":""},{"$f":"IF(KC5=\"\",\"\",VLOOKUP(KC5,Configuration!$L$7:$M$18,2))","v":""},{"$f":"IF(KD5=\"\",\"\",VLOOKUP(KD5,Configuration!$L$7:$M$18,2))","v":""},{"$f":"IF(KE5=\"\",\"\",VLOOKUP(KE5,Configuration!$L$7:$M$18,2))","v":""},{"$f":"IF(KF5=\"\",\"\",VLOOKUP(KF5,Configuration!$L$7:$M$18,2))","v":""},{"$f":"IF(KG5=\"\",\"\",VLOOKUP(KG5,Configuration!$L$7:$M$18,2))","v":""},{"$f":"IF(KH5=\"\",\"\",VLOOKUP(KH5,Configuration!$L$7:$M$18,2))","v":""},{"$f":"IF(KI5=\"\",\"\",VLOOKUP(KI5,Configuration!$L$7:$M$18,2))","v":""},{"$f":"IF(KJ5=\"\",\"\",VLOOKUP(KJ5,Configuration!$L$7:$M$18,2))","v":""},{"$f":"IF(KK5=\"\",\"\",VLOOKUP(KK5,Configuration!$L$7:$M$18,2))","v":""},{"$f":"IF(KL5=\"\",\"\",VLOOKUP(KL5,Configuration!$L$7:$M$18,2))","v":""},{"$f":"IF(KM5=\"\",\"\",VLOOKUP(KM5,Configuration!$L$7:$M$18,2))","v":""},{"$f":"IF(KN5=\"\",\"\",VLOOKUP(KN5,Configuration!$L$7:$M$18,2))","v":""},{"$f":"IF(KO5=\"\",\"\",VLOOKUP(KO5,Configuration!$L$7:$M$18,2))","v":""},{"$f":"IF(KP5=\"\",\"\",VLOOKUP(KP5,Configuration!$L$7:$M$18,2))","v":"juillet"},{"$f":"IF(KQ5=\"\",\"\",VLOOKUP(KQ5,Configuration!$L$7:$M$18,2))","v":""},{"$f":"IF(KR5=\"\",\"\",VLOOKUP(KR5,Configuration!$L$7:$M$18,2))","v":""},{"$f":"IF(KS5=\"\",\"\",VLOOKUP(KS5,Configuration!$L$7:$M$18,2))","v":""},{"$f":"IF(KT5=\"\",\"\",VLOOKUP(KT5,Configuration!$L$7:$M$18,2))","v":""},{"$f":"IF(KU5=\"\",\"\",VLOOKUP(KU5,Configuration!$L$7:$M$18,2))","v":""},{"$f":"IF(KV5=\"\",\"\",VLOOKUP(KV5,Configuration!$L$7:$M$18,2))","v":""},{"$f":"IF(KW5=\"\",\"\",VLOOKUP(KW5,Configuration!$L$7:$M$18,2))","v":""},{"$f":"IF(KX5=\"\",\"\",VLOOKUP(KX5,Configuration!$L$7:$M$18,2))","v":""},{"$f":"IF(KY5=\"\",\"\",VLOOKUP(KY5,Configuration!$L$7:$M$18,2))","v":""},{"$f":"IF(KZ5=\"\",\"\",VLOOKUP(KZ5,Configuration!$L$7:$M$18,2))","v":""},{"$f":"IF(LA5=\"\",\"\",VLOOKUP(LA5,Configuration!$L$7:$M$18,2))","v":""},{"$f":"IF(LB5=\"\",\"\",VLOOKUP(LB5,Configuration!$L$7:$M$18,2))","v":""},{"$f":"IF(LC5=\"\",\"\",VLOOKUP(LC5,Configuration!$L$7:$M$18,2))","v":""},{"$f":"IF(LD5=\"\",\"\",VLOOKUP(LD5,Configuration!$L$7:$M$18,2))","v":""},{"$f":"IF(LE5=\"\",\"\",VLOOKUP(LE5,Configuration!$L$7:$M$18,2))","v":""},{"$f":"IF(LF5=\"\",\"\",VLOOKUP(LF5,Configuration!$L$7:$M$18,2))","v":""},{"$f":"IF(LG5=\"\",\"\",VLOOKUP(LG5,Configuration!$L$7:$M$18,2))","v":""},{"$f":"IF(LH5=\"\",\"\",VLOOKUP(LH5,Configuration!$L$7:$M$18,2))","v":""},{"$f":"IF(LI5=\"\",\"\",VLOOKUP(LI5,Configuration!$L$7:$M$18,2))","v":""},{"$f":"IF(LJ5=\"\",\"\",VLOOKUP(LJ5,Configuration!$L$7:$M$18,2))","v":""},{"$f":"IF(LK5=\"\",\"\",VLOOKUP(LK5,Configuration!$L$7:$M$18,2))","v":""},{"$f":"IF(LL5=\"\",\"\",VLOOKUP(LL5,Configuration!$L$7:$M$18,2))","v":""},{"$f":"IF(LM5=\"\",\"\",VLOOKUP(LM5,Configuration!$L$7:$M$18,2))","v":""},{"$f":"IF(LN5=\"\",\"\",VLOOKUP(LN5,Configuration!$L$7:$M$18,2))","v":""},{"$f":"IF(LO5=\"\",\"\",VLOOKUP(LO5,Configuration!$L$7:$M$18,2))","v":""},{"$f":"IF(LP5=\"\",\"\",VLOOKUP(LP5,Configuration!$L$7:$M$18,2))","v":""},{"$f":"IF(LQ5=\"\",\"\",VLOOKUP(LQ5,Configuration!$L$7:$M$18,2))","v":""},{"$f":"IF(LR5=\"\",\"\",VLOOKUP(LR5,Configuration!$L$7:$M$18,2))","v":""},{"$f":"IF(LS5=\"\",\"\",VLOOKUP(LS5,Configuration!$L$7:$M$18,2))","v":""},{"$f":"IF(LT5=\"\",\"\",VLOOKUP(LT5,Configuration!$L$7:$M$18,2))","v":""},{"$f":"IF(LU5=\"\",\"\",VLOOKUP(LU5,Configuration!$L$7:$M$18,2))","v":"août"},{"$f":"IF(LV5=\"\",\"\",VLOOKUP(LV5,Configuration!$L$7:$M$18,2))","v":""},{"$f":"IF(LW5=\"\",\"\",VLOOKUP(LW5,Configuration!$L$7:$M$18,2))","v":""},{"$f":"IF(LX5=\"\",\"\",VLOOKUP(LX5,Configuration!$L$7:$M$18,2))","v":""},{"$f":"IF(LY5=\"\",\"\",VLOOKUP(LY5,Configuration!$L$7:$M$18,2))","v":""},{"$f":"IF(LZ5=\"\",\"\",VLOOKUP(LZ5,Configuration!$L$7:$M$18,2))","v":""},{"$f":"IF(MA5=\"\",\"\",VLOOKUP(MA5,Configuration!$L$7:$M$18,2))","v":""}]
[null,{"$f":"MONTH($B$2)","v":9},{"$f":"IF(DAY(C7)=1,MONTH(C7),\"\")","v":""},"","","","","","","","","","","","","","","","","","","","","","","","","",10,"","","","","","","","","","","","","","","","","","","","","","","","","","","","","","",11,"","","","","","",{"$f":"IF(DAY(BO7)=1,MONTH(BO7),\"\")","v":""},"","","","","","","","","","","","","","","","","","","","","","",12,"","","","","","","","","","","","","","","","","","","","","","","","","","","","","","",1,"","","","","","","","","",{"$f":"IF(DAY(EA7)=1,MONTH(EA7),\"\")","v":""},"","","","","","","","","","","","","","","","","","","","",2,"","","","","","","","","","","","","","","","","","","","","","","","","","","",3,"","","","","","","","","","","","","","",{"$f":"IF(DAY(GM7)=1,MONTH(GM7),\"\")","v":""},"","","","","","","","","","","","","","","",4,"","","","","","","","","","","","","","","","","","","","","","","","","","","","","",5,"","","","","","","","","","","","","","","","","",{"$f":"IF(DAY(IY7)=1,MONTH(IY7),\"\")","v":""},"","","","","","","","","","","","",6,"","","","","","","","","","","","","","","","","","","","","","","","","","","","","",7,"","","","","","","","","","","","","","","","","","","","",{"$f":"IF(DAY(LK7)=1,MONTH(LK7),\"\")","v":""},"","","","","","","","","",8,"","","","","",""]
["Domaines",{"$f":"WEEKDAY(Configuration!$B$17)","v":"1900-01-02"},{"$f":"WEEKDAY(B7)+1","v":"1900-01-03"},"1900-01-04","1900-01-05","1900-01-06","1900-01-07","1900-01-08","1900-01-02","1900-01-03","1900-01-04","1900-01-05","1900-01-06","1900-01-07","1900-01-08","1900-01-02","1900-01-03","1900-01-04","1900-01-05","1900-01-06","1900-01-07","1900-01-08","1900-01-02","1900-01-03","1900-01-04","1900-01-05","1900-01-06","1900-01-07","1900-01-08","1900-01-02","1900-01-03","1900-01-04","1900-01-05","1900-01-06","1900-01-07","1900-01-08","1900-01-02","1900-01-03","1900-01-04","1900-01-05","1900-01-06","1900-01-07","1900-01-08","1900-01-02","1900-01-03","1900-01-04","1900-01-05","1900-01-06","1900-01-07","1900-01-08","1900-01-02","1900-01-03","1900-01-04","1900-01-05","1900-01-06","1900-01-07","1900-01-08","1900-01-02","1900-01-03","1900-01-04","1900-01-05","1900-01-06","1900-01-07","1900-01-08","1900-01-02","1900-01-03",{"$f":"WEEKDAY(BN7)+1","v":"1900-01-04"},"1900-01-05","1900-01-06","1900-01-07","1900-01-08","1900-01-02","1900-01-03","1900-01-04","1900-01-05","1900-01-06","1900-01-07","1900-01-08","1900-01-02","1900-01-03","1900-01-04","1900-01-05","1900-01-06","1900-01-07","1900-01-08","1900-01-02","1900-01-03","1900-01-04","1900-01-05","1900-01-06","1900-01-07","1900-01-08","1900-01-02","1900-01-03","1900-01-04","1900-01-05","1900-01-06","1900-01-07","1900-01-08","1900-01-02","1900-01-03","1900-01-04","1900-01-05","1900-01-06","1900-01-07","1900-01-08","1900-01-02","1900-01-03","1900-01-04","1900-01-05","1900-01-06","1900-01-07","1900-01-08","1900-01-02","1900-01-03","1900-01-04","1900-01-05","1900-01-06","1900-01-07","1900-01-08","1900-01-02","1900-01-03","1900-01-04","1900-01-05","1900-01-06","1900-01-07","1900-01-08","1900-01-02","1900-01-03","1900-01-04",{"$f":"WEEKDAY(DZ7)+1","v":"1900-01-05"},"1900-01-06","1900-01-07","1900-01-08","1900-01-02","1900-01-03","1900-01-04","1900-01-05","1900-01-06","1900-01-07","1900-01-08","1900-01-02","1900-01-03","1900-01-04","1900-01-05","1900-01-06","1900-01-07","1900-01-08","1900-01-02","1900-01-03","1900-01-04","1900-01-05","1900-01-06","1900-01-07","1900-01-08","1900-01-02","1900-01-03","1900-01-04","1900-01-05","1900-01-06","1900-01-07","1900-01-08","1900-01-02","1900-01-03","1900-01-04","1900-01-05","1900-01-06","1900-01-07","1900-01-08","1900-01-02","1900-01-03","1900-01-04","1900-01-05","1900-01-06","1900-01-07","1900-01-08","1900-01-02","1900-01-03","1900-01-04","1900-01-05","1900-01-06","1900-01-07","1900-01-08","1900-01-02","1900-01-03","1900-01-04","1900-01-05","1900-01-06","1900-01-07","1900-01-08","1900-01-02","1900-01-03","1900-01-04","1900-01-05",{"$f":"WEEKDAY(GL7)+1","v":"1900-01-06"},"1900-01-07","1900-01-08","1900-01-02","1900-01-03","1900-01-04","1900-01-05","1900-01-06","1900-01-07","1900-01-08","1900-01-02","1900-01-03","1900-01-04","1900-01-05","1900-01-06","1900-01-07","1900-01-08","1900-01-02","1900-01-03","1900-01-04","1900-01-05","1900-01-06","1900-01-07","1900-01-08","1900-01-02","1900-01-03","1900-01-04","1900-01-05","1900-01-06","1900-01-07","1900-01-08","1900-01-02","1900-01-03","1900-01-04","1900-01-05","1900-01-06","1900-01-07","1900-01-08","1900-01-02","1900-01-03","1900-01-04","1900-01-05","1900-01-06","1900-01-07","1900-01-08","1900-01-02","1900-01-03","1900-01-04","1900-01-05","1900-01-06","1900-01-07","1900-01-08","1900-01-02","1900-01-03","1900-01-04","1900-01-05","1900-01-06","1900-01-07","1900-01-08","1900-01-02","1900-01-03","1900-01-04","1900-01-05","1900-01-06",{"$f":"WEEKDAY(IX7)+1","v":"1900-01-07"},"1900-01-08","1900-01-02","1900-01-03","1900-01-04","1900-01-05","1900-01-06","1900-01-07","1900-01-08","1900-01-02","1900-01-03","1900-01-04","1900-01-05","1900-01-06","1900-01-07","1900-01-08","1900-01-02","1900-01-03","1900-01-04","1900-01-05","1900-01-06","1900-01-07","1900-01-08","1900-01-02","1900-01-03","1900-01-04","1900-01-05","1900-01-06","1900-01-07","1900-01-08","1900-01-02","1900-01-03","1900-01-04","1900-01-05","1900-01-06","1900-01-07","1900-01-08","1900-01-02","1900-01-03","1900-01-04","1900-01-05","1900-01-06","1900-01-07","1900-01-08","1900-01-02","1900-01-03","1900-01-04","1900-01-05","1900-01-06","1900-01-07","1900-01-08","1900-01-02","1900-01-03","1900-01-04","1900-01-05","1900-01-06","1900-01-07","1900-01-08","1900-01-02","1900-01-03","1900-01-04","1900-01-05","1900-01-06","1900-01-07",{"$f":"WEEKDAY(LJ7)+1","v":"1900-01-08"},"1900-01-02","1900-01-03","1900-01-04","1900-01-05","1900-01-06","1900-01-07","1900-01-08","1900-01-02","1900-01-03","1900-01-04","1900-01-05","1900-01-06","1900-01-07","1900-01-08","1900-01-02","1900-01-03"]
[null,{"$f":"B2","v":"2017-09-04"},{"$f":"B7+1","v":"2017-09-05"},"2017-09-06","2017-09-07","2017-09-08","2017-09-09","2017-09-10","2017-09-11","2017-09-12","2017-09-13","2017-09-14","2017-09-15","2017-09-16","2017-09-17","2017-09-18","2017-09-19","2017-09-20","2017-09-21","2017-09-22","2017-09-23","2017-09-24","2017-09-25","2017-09-26","2017-09-27","2017-09-28","2017-09-29","2017-09-30","2017-10-01","2017-10-02","2017-10-03","2017-10-04","2017-10-05","2017-10-06","2017-10-07","2017-10-08","2017-10-09","2017-10-10","2017-10-11","2017-10-12","2017-10-13","2017-10-14","2017-10-15","2017-10-16","2017-10-17","2017-10-18","2017-10-19","2017-10-20","2017-10-21","2017-10-22","2017-10-23","2017-10-24","2017-10-25","2017-10-26","2017-10-27","2017-10-28","2017-10-29","2017-10-30","2017-10-31","2017-11-01","2017-11-02","2017-11-03","2017-11-04","2017-11-05","2017-11-06","2017-11-07",{"$f":"BN7+1","v":"2017-11-08"},"2017-11-09","2017-11-10","2017-11-11","2017-11-12","2017-11-13","2017-11-14","2017-11-15","2017-11-16","2017-11-17","2017-11-18","2017-11-19","2017-11-20","2017-11-21","2017-11-22","2017-11-23","2017-11-24","2017-11-25","2017-11-26","2017-11-27","2017-11-28","2017-11-29","2017-11-30","2017-12-01","2017-12-02","2017-12-03","2017-12-04","2017-12-05","2017-12-06","2017-12-07","2017-12-08","2017-12-09","2017-12-10","2017-12-11","2017-12-12","2017-12-13","2017-12-14","2017-12-15","2017-12-16","2017-12-17","2017-12-18","2017-12-19","2017-12-20","2017-12-21","2017-12-22","2017-12-23","2017-12-24","2017-12-25","2017-12-26","2017-12-27","2017-12-28","2017-12-29","2017-12-30","2017-12-31","2018-01-01","2018-01-02","2018-01-03","2018-01-04","2018-01-05","2018-01-06","2018-01-07","2018-01-08","2018-01-09","2018-01-10",{"$f":"DZ7+1","v":"2018-01-11"},"2018-01-12","2018-01-13","2018-01-14","2018-01-15","2018-01-16","2018-01-17","2018-01-18","2018-01-19","2018-01-20","2018-01-21","2018-01-22","2018-01-23","2018-01-24","2018-01-25","2018-01-26","2018-01-27","2018-01-28","2018-01-29","2018-01-30","2018-01-31","2018-02-01","2018-02-02","2018-02-03","2018-02-04","2018-02-05","2018-02-06","2018-02-07","2018-02-08","2018-02-09","2018-02-10","2018-02-11","2018-02-12","2018-02-13","2018-02-14","2018-02-15","2018-02-16","2018-02-17","2018-02-18","2018-02-19","2018-02-20","2018-02-21","2018-02-22","2018-02-23","2018-02-24","2018-02-25","2018-02-26","2018-02-27","2018-02-28","2018-03-01","2018-03-02","2018-03-03","2018-03-04","2018-03-05","2018-03-06","2018-03-07","2018-03-08","2018-03-09","2018-03-10","2018-03-11","2018-03-12","2018-03-13","2018-03-14","2018-03-15",{"$f":"GL7+1","v":"2018-03-16"},"2018-03-17","2018-03-18","2018-03-19","2018-03-20","2018-03-21","2018-03-22","2018-03-23","2018-03-24","2018-03-25","2018-03-26","2018-03-27","2018-03-28","2018-03-29","2018-03-30","2018-03-31","2018-04-01","2018-04-02","2018-04-03","2018-04-04","2018-04-05","2018-04-06","2018-04-07","2018-04-08","2018-04-09","2018-04-10","2018-04-11","2018-04-12","2018-04-13","2018-04-14","2018-04-15","2018-04-16","2018-04-17","2018-04-18","2018-04-19","2018-04-20","2018-04-21","2018-04-22","2018-04-23","2018-04-24","2018-04-25","2018-04-26","2018-04-27","2018-04-28","2018-04-29","2018-04-30","2018-05-01","2018-05-02","2018-05-03","2018-05-04","2018-05-05","2018-05-06","2018-05-07","2018-05-08","2018-05-09","2018-05-10","2018-05-11","2018-05-12","2018-05-13","2018-05-14","2018-05-15","2018-05-16","2018-05-17","2018-05-18",{"$f":"IX7+1","v":"2018-05-19"},"2018-05-20","2018-05-21","2018-05-22","2018-05-23","2018-05-24","2018-05-25","2018-05-26","2018-05-27","2018-05-28","2018-05-29","2018-05-30","2018-05-31","2018-06-01","2018-06-02","2018-06-03","2018-06-04","2018-06-05","2018-06-06","2018-06-07","2018-06-08","2018-06-09","2018-06-10","2018-06-11","2018-06-12","2018-06-13","2018-06-14","2018-06-15","2018-06-16","2018-06-17","2018-06-18","2018-06-19","2018-06-20","2018-06-21","2018-06-22","2018-06-23","2018-06-24","2018-06-25","2018-06-26","2018-06-27","2018-06-28","2018-06-29","2018-06-30","2018-07-01","2018-07-02","2018-07-03","2018-07-04","2018-07-05","2018-07-06","2018-07-07","2018-07-08","2018-07-09","2018-07-10","2018-07-11","2018-07-12","2018-07-13","2018-07-14","2018-07-15","2018-07-16","2018-07-17","2018-07-18","2018-07-19","2018-07-20","2018-07-21",{"$f":"LJ7+1","v":"2018-07-22"},"2018-07-23","2018-07-24","2018-07-25","2018-07-26","2018-07-27","2018-07-28","2018-07-29","2018-07-30","2018-07-31","2018-08-01","2018-08-02","2018-08-03","2018-08-04","2018-08-05","2018-08-06","2018-08-07"]
["histoire","Antiquité"]
["Grammaire","La phrase types et formes",null,null,null,null,null,null,null,null,null,null,null,null,null,null,null,null,null,null,null,"EVAL",null,null,null,"Phrases simples et complexes"]
["Conjugaison","La temporalité d'une phrase",null,null,null,null,null,null,null,null,null,null,null,null,null,null,null,null,"EVAL","Repérer le verbe dans une phrase"]
[]
[]
["Calcul","L'addition et la soustraction"]
["Géométrie","Vocabulaire de base, la droite, le segment, le milieu, le point,etc…"]
[]
["Sciences","Les états de l'eau",null,null,null,null,null,null,null,null,null,null,null,null,null,null,null,null,null,null,null,null,null,null,null,null,null,null,null,null,null,null,null,null,null,null,null,null,null,null,null,null,null,"EVAL"]